BDBM31990 Dipeptidyl nitrile inhibitor, 23
SMILES: CCc1cc(C(=O)N[C@@H](Cc2cccc(Cl)c2)C(=O)NCC#N)n(C)n1
InChI Key: InChIKey=NKSUVPDDRBSPTR-HNNXBMFYSA-N
Data: 5 IC50
Activity Spreadsheet -- Enzyme Inhibition Constant Data from BindingDB
Found 5 hits for monomerid = 31990
Trg + Lig
Ki
nM
ΔG°
kcal/mole
IC50
nM
Kd
nM
EC50/IC50
nM
koff
s-1
kon
M-1s-1
pHTemp
°C
Cathepsin L
(Homo sapiens (Human))
BDBM31990
(Dipeptidyl nitrile inhibitor, 23)
Show SMILES CCc1cc(C(=O)N[C@@H](Cc2cccc(Cl)c2)C(=O)NCC#N)n(C)n1 |r|
Show InChI InChI=1S/C18H20ClN5O2/c1-3-14-11-16(24(2)23-14)18(26)22-15(17(25)21-8-7-20)10-12-5-4-6-13(19)9-12/h4-6,9,11,15H,3,8,10H2,1-2H3,(H,21,25)(H,22,26)/t15-/m0/s1
n/an/a 63n/an/an/an/a7.037
AstraZeneca
Assay Description
IC50 values for inhibition of Cathepsins were determined from dose dependent inhibition of cleavage of fluorogenic, AMC-tagged, peptide substrates.
Bioorg Med Chem Lett 19: 4280-3 (2009)
Article DOI: 10.1016/j.bmcl.2009.05.071
BindingDB Entry DOI: 10.7270/Q2TT4PBM
Cathepsin L2
(Homo sapiens (Human))
BDBM31990
(Dipeptidyl nitrile inhibitor, 23)
Show SMILES CCc1cc(C(=O)N[C@@H](Cc2cccc(Cl)c2)C(=O)NCC#N)n(C)n1 |r|
Show InChI InChI=1S/C18H20ClN5O2/c1-3-14-11-16(24(2)23-14)18(26)22-15(17(25)21-8-7-20)10-12-5-4-6-13(19)9-12/h4-6,9,11,15H,3,8,10H2,1-2H3,(H,21,25)(H,22,26)/t15-/m0/s1
n/an/a 501n/an/an/an/an/an/a
AstraZeneca
Assay Description
IC50 values for inhibition of Cathepsins were determined from dose dependent inhibition of cleavage of fluorogenic, AMC-tagged, peptide substrates.
Bioorg Med Chem Lett 19: 4280-3 (2009)
Article DOI: 10.1016/j.bmcl.2009.05.071
BindingDB Entry DOI: 10.7270/Q2TT4PBM
Cathepsin B
(Homo sapiens (Human))
BDBM31990
(Dipeptidyl nitrile inhibitor, 23)
Show SMILES CCc1cc(C(=O)N[C@@H](Cc2cccc(Cl)c2)C(=O)NCC#N)n(C)n1 |r|
Show InChI InChI=1S/C18H20ClN5O2/c1-3-14-11-16(24(2)23-14)18(26)22-15(17(25)21-8-7-20)10-12-5-4-6-13(19)9-12/h4-6,9,11,15H,3,8,10H2,1-2H3,(H,21,25)(H,22,26)/t15-/m0/s1
Reactome pathway
n/an/a 7.94E+3n/an/an/an/an/an/a
AstraZeneca
Assay Description
IC50 values for inhibition of Cathepsins were determined from dose dependent inhibition of cleavage of fluorogenic, AMC-tagged, peptide substrates.
Bioorg Med Chem Lett 19: 4280-3 (2009)
Article DOI: 10.1016/j.bmcl.2009.05.071
BindingDB Entry DOI: 10.7270/Q2TT4PBM
Cathepsin K
(Homo sapiens (Human))
BDBM31990
(Dipeptidyl nitrile inhibitor, 23)
Show SMILES CCc1cc(C(=O)N[C@@H](Cc2cccc(Cl)c2)C(=O)NCC#N)n(C)n1 |r|
Show InChI InChI=1S/C18H20ClN5O2/c1-3-14-11-16(24(2)23-14)18(26)22-15(17(25)21-8-7-20)10-12-5-4-6-13(19)9-12/h4-6,9,11,15H,3,8,10H2,1-2H3,(H,21,25)(H,22,26)/t15-/m0/s1
Reactome pathway
n/an/a 5.01E+3n/an/an/an/an/an/a
AstraZeneca
Assay Description
IC50 values for inhibition of Cathepsins were determined from dose dependent inhibition of cleavage of fluorogenic, AMC-tagged, peptide substrates.
Bioorg Med Chem Lett 19: 4280-3 (2009)
Article DOI: 10.1016/j.bmcl.2009.05.071
BindingDB Entry DOI: 10.7270/Q2TT4PBM
Cathepsin S
(Homo sapiens (Human))
BDBM31990
(Dipeptidyl nitrile inhibitor, 23)
Show SMILES CCc1cc(C(=O)N[C@@H](Cc2cccc(Cl)c2)C(=O)NCC#N)n(C)n1 |r|
Show InChI InChI=1S/C18H20ClN5O2/c1-3-14-11-16(24(2)23-14)18(26)22-15(17(25)21-8-7-20)10-12-5-4-6-13(19)9-12/h4-6,9,11,15H,3,8,10H2,1-2H3,(H,21,25)(H,22,26)/t15-/m0/s1
Reactome pathway
n/an/a 794n/an/an/an/an/an/a
AstraZeneca
Assay Description
IC50 values for inhibition of Cathepsins were determined from dose dependent inhibition of cleavage of fluorogenic, AMC-tagged, peptide substrates.
Bioorg Med Chem Lett 19: 4280-3 (2009)
Article DOI: 10.1016/j.bmcl.2009.05.071
BindingDB Entry DOI: 10.7270/Q2TT4PBM