BDBM32001 7-Oxo-7H-benzo[e]perimidine-4-carboxylic acid::7-ketobenzo[e]perimidine-4-carboxylic acid::7-oxidanylidenebenzo[e]perimidine-4-carboxylic acid::7-oxo-4-benzo[e]perimidinecarboxylic acid::7-oxobenzo[e]perimidine-4-carboxylic acid::CHEMBL166209::MLS000077061::SMR000008738::cid_72574
SMILES: OC(=O)c1ccc2C(=O)c3ccccc3-c3ncnc1c23
InChI Key: InChIKey=NARZOZMHJMTCGC-UHFFFAOYSA-N
Data: 1 KI  7 IC50  5 EC50
Activity Spreadsheet -- Enzyme Inhibition Constant Data from BindingDB
Found 13 hits for monomerid = 32001
Trg + Lig
Ki
nM
ΔG°
kcal/mole
IC50
nM
Kd
nM
EC50/IC50
nM
koff
s-1
kon
M-1s-1
pHTemp
°C
Corticotropin releasing factor receptor 2
(Mus musculus)
BDBM32001
(7-Oxo-7H-benzo[e]perimidine-4-carboxylic acid | 7-...)
Show SMILES OC(=O)c1ccc2C(=O)c3ccccc3-c3ncnc1c23
Show InChI InChI=1S/C16H8N2O3/c19-15-9-4-2-1-3-8(9)13-12-10(15)5-6-11(16(20)21)14(12)18-7-17-13/h1-7H,(H,20,21)
Reactome pathway
>1.00E+5n/an/an/an/an/an/an/an/a
A Subsidiary of Agouron Pharmaceuticals, Inc.
Curated by ChEMBL
Assay Description
Antagonistic activity against [125I]-Tyr-ovine CRF binding to Corticotropin releasing factor receptor 2 beta (30% inhibition at 100 uM)
Bioorg Med Chem Lett 9: 765-70 (1999)
BindingDB Entry DOI: 10.7270/Q2TD9WJJ
Bfl-1
(Mus musculus (Mouse))
BDBM32001
(7-Oxo-7H-benzo[e]perimidine-4-carboxylic acid | 7-...)
Show SMILES OC(=O)c1ccc2C(=O)c3ccccc3-c3ncnc1c23
Show InChI InChI=1S/C16H8N2O3/c19-15-9-4-2-1-3-8(9)13-12-10(15)5-6-11(16(20)21)14(12)18-7-17-13/h1-7H,(H,20,21)
PCBioAssay
n/an/a>1.00E+5n/an/an/an/a7.023
Burnham Center for Chemical Genomics
Curated by PubChem BioAssay
Assay Description
The aim is to identify chemical probes of Bfl-1 through a fluorescence polarization assay (FPA) using FITC-Bid BH3 peptide. 1) Dose-response curves c...
PubChem Bioassay (2008)
BindingDB Entry DOI: 10.7270/Q2N014W6
tyrosine 3-monooxygenase/tryptophan 5-monooxygenase activation protein, gamma polypeptide
(Homo sapiens (Human))
BDBM32001
(7-Oxo-7H-benzo[e]perimidine-4-carboxylic acid | 7-...)
Show SMILES OC(=O)c1ccc2C(=O)c3ccccc3-c3ncnc1c23
Show InChI InChI=1S/C16H8N2O3/c19-15-9-4-2-1-3-8(9)13-12-10(15)5-6-11(16(20)21)14(12)18-7-17-13/h1-7H,(H,20,21)
Reactome pathway
PCBioAssay
n/an/a>5.00E+4n/an/an/an/an/an/a
Emory University Molecular Libraries Screening Center
Curated by PubChem BioAssay
Assay Description
NIH Molecular Libraries Screening Centers Network [MLSCN] Emory Chemical Biology Discovery Center in MLSCN MLSCN Grant: 1 X01MH78953-01 The 14-3-3 pr...
PubChem Bioassay (2007)
BindingDB Entry DOI: 10.7270/Q2V986FT
Bfl-1
(Mus musculus (Mouse))
BDBM32001
(7-Oxo-7H-benzo[e]perimidine-4-carboxylic acid | 7-...)
Show SMILES OC(=O)c1ccc2C(=O)c3ccccc3-c3ncnc1c23
Show InChI InChI=1S/C16H8N2O3/c19-15-9-4-2-1-3-8(9)13-12-10(15)5-6-11(16(20)21)14(12)18-7-17-13/h1-7H,(H,20,21)
PCBioAssay
n/an/a>1.00E+5n/an/an/an/an/an/a
Sanford-Burnham Center for Chemical Genomics
Curated by PubChem BioAssay
Assay Description
Sanford-Burnham Center for Chemical Genomics (SBCCG) Sanford-Burnham Medical Research Institute (San Diego, CA) NIH Molecular Libraries Screening Cen...
PubChem Bioassay (2008)
BindingDB Entry DOI: 10.7270/Q2K072NW
POsterior Segregation family member (pos-1)
(Caenorhabditis elegans)
BDBM32001
(7-Oxo-7H-benzo[e]perimidine-4-carboxylic acid | 7-...)
Show SMILES OC(=O)c1ccc2C(=O)c3ccccc3-c3ncnc1c23
Show InChI InChI=1S/C16H8N2O3/c19-15-9-4-2-1-3-8(9)13-12-10(15)5-6-11(16(20)21)14(12)18-7-17-13/h1-7H,(H,20,21)
PCBioAssay
n/an/an/an/a 3.48E+4n/an/an/an/a
Broad Institute
Curated by PubChem BioAssay
Assay Description
Broad Institute: MLPCN maternal gene expression Project ID: 2024 Keywords: Zinc finger, C. elegans, maternal gene expression, RNA-protein interac...
PubChem Bioassay (2009)
BindingDB Entry DOI: 10.7270/Q28G8J4C
RecName: Full=Zinc finger protein mex-5
(Caenorhabditis elegans)
BDBM32001
(7-Oxo-7H-benzo[e]perimidine-4-carboxylic acid | 7-...)
Show SMILES OC(=O)c1ccc2C(=O)c3ccccc3-c3ncnc1c23
Show InChI InChI=1S/C16H8N2O3/c19-15-9-4-2-1-3-8(9)13-12-10(15)5-6-11(16(20)21)14(12)18-7-17-13/h1-7H,(H,20,21)
PCBioAssay
n/an/an/an/a 3.19E+4n/an/an/an/a
Broad Institute
Curated by PubChem BioAssay
Assay Description
Broad Institute: MLPCN maternal gene expression Project ID: 2024 Keywords: Zinc finger, C. elegans, maternal gene expression, RNA-protein interac...
PubChem Bioassay (2009)
BindingDB Entry DOI: 10.7270/Q2D798VP
streptokinase A precursor
(Streptococcus pyogenes M1 GAS)
BDBM32001
(7-Oxo-7H-benzo[e]perimidine-4-carboxylic acid | 7-...)
Show SMILES OC(=O)c1ccc2C(=O)c3ccccc3-c3ncnc1c23
Show InChI InChI=1S/C16H8N2O3/c19-15-9-4-2-1-3-8(9)13-12-10(15)5-6-11(16(20)21)14(12)18-7-17-13/h1-7H,(H,20,21)
PCBioAssay
n/an/an/an/a 1.60E+4n/an/an/an/a
Broad Institute
Curated by PubChem BioAssay
Assay Description
Keywords: Group A streptococcus, GAS, streptokinase, expression, virulence, inhibition, dose response, EC50 Assay Overview: The goal of this assa...
PubChem Bioassay (2009)
BindingDB Entry DOI: 10.7270/Q2736PBV
DNA recombination protein RecA
(Mycobacterium tuberculosis H37Rv)
BDBM32001
(7-Oxo-7H-benzo[e]perimidine-4-carboxylic acid | 7-...)
Show SMILES OC(=O)c1ccc2C(=O)c3ccccc3-c3ncnc1c23
Show InChI InChI=1S/C16H8N2O3/c19-15-9-4-2-1-3-8(9)13-12-10(15)5-6-11(16(20)21)14(12)18-7-17-13/h1-7H,(H,20,21)
PCBioAssay
n/an/an/an/a 4.36E+3n/an/an/an/a
Broad Institute
Curated by PubChem BioAssay
Assay Description
Keywords: GFP, refolding, reducing reagent, GFP fluorescence Assay Overview: M. tuberculosis harbors three inteins, which interrupt the DnaB, RecA, a...
PubChem Bioassay (2010)
BindingDB Entry DOI: 10.7270/Q2FN14NR
Human immunodeficiency virus type 1 REV
(Human immunodeficiency virus 1)
BDBM32001
(7-Oxo-7H-benzo[e]perimidine-4-carboxylic acid | 7-...)
Show SMILES OC(=O)c1ccc2C(=O)c3ccccc3-c3ncnc1c23
Show InChI InChI=1S/C16H8N2O3/c19-15-9-4-2-1-3-8(9)13-12-10(15)5-6-11(16(20)21)14(12)18-7-17-13/h1-7H,(H,20,21)
Reactome pathway
PCBioAssay
n/an/a 9.78E+3n/an/an/an/an/an/a
The Scripps Research Institute Molecular Screening Center
Curated by PubChem BioAssay
Assay Description
Source (MLPCN Center Name): The Scripps Research Institute Molecular Screening Center (SRIMSC) Affiliation: The Scripps Research Institute, TSRI Assa...
PubChem Bioassay (2010)
BindingDB Entry DOI: 10.7270/Q29W0CZG
defective in Germ Line Development family member (gld-1)
(Caenorhabditis elegans)
BDBM32001
(7-Oxo-7H-benzo[e]perimidine-4-carboxylic acid | 7-...)
Show SMILES OC(=O)c1ccc2C(=O)c3ccccc3-c3ncnc1c23
Show InChI InChI=1S/C16H8N2O3/c19-15-9-4-2-1-3-8(9)13-12-10(15)5-6-11(16(20)21)14(12)18-7-17-13/h1-7H,(H,20,21)
PCBioAssay
n/an/a 3.51E+3n/an/an/an/an/an/a
The Scripps Research Institute Molecular Screening Center
Curated by PubChem BioAssay
Assay Description
Source (MLPCN Center Name): The Scripps Research Institute Molecular Screening Center (SRIMSC) Affiliation: The Scripps Research Institute, TSRI Assa...
PubChem Bioassay (2010)
BindingDB Entry DOI: 10.7270/Q2QC01ZW
DNA recombination protein RecA
(Mycobacterium tuberculosis H37Rv)
BDBM32001
(7-Oxo-7H-benzo[e]perimidine-4-carboxylic acid | 7-...)
Show SMILES OC(=O)c1ccc2C(=O)c3ccccc3-c3ncnc1c23
Show InChI InChI=1S/C16H8N2O3/c19-15-9-4-2-1-3-8(9)13-12-10(15)5-6-11(16(20)21)14(12)18-7-17-13/h1-7H,(H,20,21)
PCBioAssay
n/an/an/an/a 1.77E+3n/an/an/an/a
Broad Institute
Curated by PubChem BioAssay
Assay Description
Keywords: GFP-RecA intein, protein splicing, refolding, reducing reagent, GFP fluorescence Assay Overview: M. tuberculosis harbors three inteins, whi...
PubChem Bioassay (2010)
BindingDB Entry DOI: 10.7270/Q2DR2SX9
Heat shock protein HSP 90-alpha
(Homo sapiens (Human))
BDBM32001
(7-Oxo-7H-benzo[e]perimidine-4-carboxylic acid | 7-...)
Show SMILES OC(=O)c1ccc2C(=O)c3ccccc3-c3ncnc1c23
Show InChI InChI=1S/C16H8N2O3/c19-15-9-4-2-1-3-8(9)13-12-10(15)5-6-11(16(20)21)14(12)18-7-17-13/h1-7H,(H,20,21)
NCI pathway
Reactome pathway
PCBioAssay
n/an/a 5.22E+3n/an/an/an/a7.423
Emory University Molecular Libraries Screening Center
Curated by PubChem BioAssay
Assay Description
A fluorescence polarization based HTS assay has been developed and optimized for the identification of Hsp90 inhibitors by using tumor cell lysate Hs...
PubChem Bioassay (2007)
BindingDB Entry DOI: 10.7270/Q2Q23XM6
BZLF2
(Human herpesvirus 4 type 2)
BDBM32001
(7-Oxo-7H-benzo[e]perimidine-4-carboxylic acid | 7-...)
Show SMILES OC(=O)c1ccc2C(=O)c3ccccc3-c3ncnc1c23
Show InChI InChI=1S/C16H8N2O3/c19-15-9-4-2-1-3-8(9)13-12-10(15)5-6-11(16(20)21)14(12)18-7-17-13/h1-7H,(H,20,21)
PCBioAssay
n/an/a 4.12E+3n/an/an/an/an/an/a
Emory University Molecular Libraries Screening Center
Curated by PubChem BioAssay
Assay Description
NIH Molecular Libraries Screening Centers Network [MLSCN] Emory Chemical Biology Discovery Center in MLSCN Assay provider: Theodore Jardetzky; Northw...
PubChem Bioassay (2008)
BindingDB Entry DOI: 10.7270/Q2057DCW