BDBM321948 (E)-1-(4-(5-Methyl-1,3,4-oxadiazol-2-yl)piperidin-1-yl)-3-(2-((5-methyl-2H-tetrazol-2-yl)methyl)-4-(trifluoromethyl)phenyl)prop-2-en-1-one::US10183025, Example 57::US9763957, Example 57
SMILES: Cc1nnn(Cc2cc(ccc2\C=C\C(=O)N2CCC(CC2)c2nnc(C)o2)C(F)(F)F)n1
InChI Key: InChIKey=YFDNXWTWDPWCOC-GQCTYLIASA-N
Data: 2 IC50
Activity Spreadsheet -- Enzyme Inhibition Constant Data from BindingDB
Found 5 hits for monomerid = 321948
Trg + Lig
Ki
nM
ΔG°
kcal/mole
IC50
nM
Kd
nM
EC50/IC50
nM
koff
s-1
kon
M-1s-1
pHTemp
°C
Ectonucleotide pyrophosphatase/phosphodiesterase family member 2
(Homo sapiens (Human))
BDBM321948
((E)-1-(4-(5-Methyl-1,3,4-oxadiazol-2-yl)piperidin-...)
Show SMILES Cc1nnn(Cc2cc(ccc2\C=C\C(=O)N2CCC(CC2)c2nnc(C)o2)C(F)(F)F)n1
Show InChI InChI=1S/C21H22F3N7O2/c1-13-25-29-31(28-13)12-17-11-18(21(22,23)24)5-3-15(17)4-6-19(32)30-9-7-16(8-10-30)20-27-26-14(2)33-20/h3-6,11,16H,7-10,12H2,1-2H3/b6-4+
US Patent
n/an/a 8n/an/an/an/an/an/a
Novartis AG
US Patent
Assay Description
Reagents LPC (oleoyl (18:1)) was purchased from Avanti Polar Lipids (Alabaster, Ala.) and solubilized in methanol to 20 mM. Amplex Red was obtained f...
US Patent US10183025 (2019)
BindingDB Entry DOI: 10.7270/Q2RN39XZ
Ataxin-1
(Homo sapiens (Human))
BDBM321948
((E)-1-(4-(5-Methyl-1,3,4-oxadiazol-2-yl)piperidin-...)
Show SMILES Cc1nnn(Cc2cc(ccc2\C=C\C(=O)N2CCC(CC2)c2nnc(C)o2)C(F)(F)F)n1
Show InChI InChI=1S/C21H22F3N7O2/c1-13-25-29-31(28-13)12-17-11-18(21(22,23)24)5-3-15(17)4-6-19(32)30-9-7-16(8-10-30)20-27-26-14(2)33-20/h3-6,11,16H,7-10,12H2,1-2H3/b6-4+
US Patent
n/an/a 8n/an/an/an/an/an/a
Novartis AG
US Patent
Assay Description
Method All experimental measurements were performed in black 384 well polystyrene (low volume, round bottom, Corning (3676)) plates. PerkinElmer EnVi...
US Patent US9763957 (2017)
BindingDB Entry DOI: 10.7270/Q2QF8W0D
Ectonucleotide pyrophosphatase/phosphodiesterase family member 2
(Homo sapiens (Human))
BDBM321948
((E)-1-(4-(5-Methyl-1,3,4-oxadiazol-2-yl)piperidin-...)
Show SMILES Cc1nnn(Cc2cc(ccc2\C=C\C(=O)N2CCC(CC2)c2nnc(C)o2)C(F)(F)F)n1
Show InChI InChI=1S/C21H22F3N7O2/c1-13-25-29-31(28-13)12-17-11-18(21(22,23)24)5-3-15(17)4-6-19(32)30-9-7-16(8-10-30)20-27-26-14(2)33-20/h3-6,11,16H,7-10,12H2,1-2H3/b6-4+
n/an/a 8n/an/an/an/an/an/a
TBA
Citation and Details
1,3-beta-glucan synthase component GLS2
(Saccharomyces cerevisiae)
BDBM321948
((E)-1-(4-(5-Methyl-1,3,4-oxadiazol-2-yl)piperidin-...)
Show SMILES Cc1nnn(Cc2cc(ccc2\C=C\C(=O)N2CCC(CC2)c2nnc(C)o2)C(F)(F)F)n1
Show InChI InChI=1S/C21H22F3N7O2/c1-13-25-29-31(28-13)12-17-11-18(21(22,23)24)5-3-15(17)4-6-19(32)30-9-7-16(8-10-30)20-27-26-14(2)33-20/h3-6,11,16H,7-10,12H2,1-2H3/b6-4+
n/an/a 2.30E+4n/an/an/an/an/an/a
TBA
Citation and Details
Ectonucleotide pyrophosphatase/phosphodiesterase family member 2
(Homo sapiens (Human))
BDBM321948
((E)-1-(4-(5-Methyl-1,3,4-oxadiazol-2-yl)piperidin-...)
Show SMILES Cc1nnn(Cc2cc(ccc2\C=C\C(=O)N2CCC(CC2)c2nnc(C)o2)C(F)(F)F)n1
Show InChI InChI=1S/C21H22F3N7O2/c1-13-25-29-31(28-13)12-17-11-18(21(22,23)24)5-3-15(17)4-6-19(32)30-9-7-16(8-10-30)20-27-26-14(2)33-20/h3-6,11,16H,7-10,12H2,1-2H3/b6-4+
n/an/a 12n/an/an/an/an/an/a
TBA
Citation and Details