BDBM322044 (E)-3-(4-Chloro-2-((5-methyl-2H-tetrazol-2-yl)methyl)phenyl)-1-(4-((5-methoxypyridin-2-yl)methyl)piperazin-1-yl)prop-2-en-1-one::US10183025, Example 140.1::US9763957, Example 140.1
SMILES: COc1ccc(CN2CCN(CC2)C(=O)\C=C\c2ccc(Cl)cc2Cn2nnc(C)n2)nc1
InChI Key: InChIKey=JQTRFEYTVDZWMO-XBXARRHUSA-N
Data: 2 IC50
Activity Spreadsheet -- Enzyme Inhibition Constant Data from BindingDB
Found 4 hits for monomerid = 322044
Trg + Lig
Ki
nM
ΔG°
kcal/mole
IC50
nM
Kd
nM
EC50/IC50
nM
koff
s-1
kon
M-1s-1
pHTemp
°C
Ectonucleotide pyrophosphatase/phosphodiesterase family member 2
(Homo sapiens (Human))
BDBM322044
((E)-3-(4-Chloro-2-((5-methyl-2H-tetrazol-2-yl)meth...)
Show SMILES COc1ccc(CN2CCN(CC2)C(=O)\C=C\c2ccc(Cl)cc2Cn2nnc(C)n2)nc1
Show InChI InChI=1S/C23H26ClN7O2/c1-17-26-28-31(27-17)15-19-13-20(24)5-3-18(19)4-8-23(32)30-11-9-29(10-12-30)16-21-6-7-22(33-2)14-25-21/h3-8,13-14H,9-12,15-16H2,1-2H3/b8-4+
US Patent
n/an/a 5.90n/an/an/an/an/an/a
Novartis AG
US Patent
Assay Description
Reagents LPC (oleoyl (18:1)) was purchased from Avanti Polar Lipids (Alabaster, Ala.) and solubilized in methanol to 20 mM. Amplex Red was obtained f...
US Patent US10183025 (2019)
BindingDB Entry DOI: 10.7270/Q2RN39XZ
Ectonucleotide pyrophosphatase/phosphodiesterase family member 2
(Homo sapiens (Human))
BDBM322044
((E)-3-(4-Chloro-2-((5-methyl-2H-tetrazol-2-yl)meth...)
Show SMILES COc1ccc(CN2CCN(CC2)C(=O)\C=C\c2ccc(Cl)cc2Cn2nnc(C)n2)nc1
Show InChI InChI=1S/C23H26ClN7O2/c1-17-26-28-31(27-17)15-19-13-20(24)5-3-18(19)4-8-23(32)30-11-9-29(10-12-30)16-21-6-7-22(33-2)14-25-21/h3-8,13-14H,9-12,15-16H2,1-2H3/b8-4+
n/an/a 5.90n/an/an/an/an/an/a
TBA
Citation and Details
1,3-beta-glucan synthase component GLS2
(Saccharomyces cerevisiae)
BDBM322044
((E)-3-(4-Chloro-2-((5-methyl-2H-tetrazol-2-yl)meth...)
Show SMILES COc1ccc(CN2CCN(CC2)C(=O)\C=C\c2ccc(Cl)cc2Cn2nnc(C)n2)nc1
Show InChI InChI=1S/C23H26ClN7O2/c1-17-26-28-31(27-17)15-19-13-20(24)5-3-18(19)4-8-23(32)30-11-9-29(10-12-30)16-21-6-7-22(33-2)14-25-21/h3-8,13-14H,9-12,15-16H2,1-2H3/b8-4+
n/an/a 1.90E+3n/an/an/an/an/an/a
TBA
Citation and Details
Ataxin-1
(Homo sapiens (Human))
BDBM322044
((E)-3-(4-Chloro-2-((5-methyl-2H-tetrazol-2-yl)meth...)
Show SMILES COc1ccc(CN2CCN(CC2)C(=O)\C=C\c2ccc(Cl)cc2Cn2nnc(C)n2)nc1
Show InChI InChI=1S/C23H26ClN7O2/c1-17-26-28-31(27-17)15-19-13-20(24)5-3-18(19)4-8-23(32)30-11-9-29(10-12-30)16-21-6-7-22(33-2)14-25-21/h3-8,13-14H,9-12,15-16H2,1-2H3/b8-4+
US Patent
n/an/a 5.90n/an/an/an/an/an/a
Novartis AG
US Patent
Assay Description
Method All experimental measurements were performed in black 384 well polystyrene (low volume, round bottom, Corning (3676)) plates. PerkinElmer EnVi...
US Patent US9763957 (2017)
BindingDB Entry DOI: 10.7270/Q2QF8W0D