BDBM323033 (1R,2R)-N-(5-Methyl-4-oxo-4,5,6,7- tetrahydropyrazolo[1,5-a]pyrazin-3-yl)-2- [4-(1H-pyrazol-3- yl)benzoyl]cyclohexanecarboxamide::US10183947, Example 17::US10508119, Example 17
SMILES: CN1CCn2ncc(NC(=O)[C@@H]3CCCC[C@H]3C(=O)c3ccc(cc3)-c3cc[nH]n3)c2C1=O
InChI Key:
Data: 3 IC50
Activity Spreadsheet -- Enzyme Inhibition Constant Data from BindingDB
Found 3 hits for monomerid = 323033
Trg + Lig
Ki
nM
ΔG°
kcal/mole
IC50
nM
Kd
nM
EC50/IC50
nM
koff
s-1
kon
M-1s-1
pHTemp
°C
Arachidonate 5-lipoxygenase
(Homo sapiens (Human))
BDBM323033
((1R,2R)-N-(5-Methyl-4-oxo-4,5,6,7- tetrahydropyraz...)
Show SMILES CN1CCn2ncc(NC(=O)[C@@H]3CCCC[C@H]3C(=O)c3ccc(cc3)-c3cc[nH]n3)c2C1=O |r|
Reactome pathway
US Patent
n/an/a 20n/an/an/an/an/an/a
ASTRAZENECA AB
US Patent
Assay Description
Compounds were tested in a competition binding assay using 3H-MK591 as tracer. (Preparation of MK-591 is described in Bioorg. Med. Chem. Lett. 1999, ...
US Patent US10183947 (2019)
BindingDB Entry DOI: 10.7270/Q22Z17M7
Flap endonuclease 1
(Homo sapiens (Human))
BDBM323033
((1R,2R)-N-(5-Methyl-4-oxo-4,5,6,7- tetrahydropyraz...)
Show SMILES CN1CCn2ncc(NC(=O)[C@@H]3CCCC[C@H]3C(=O)c3ccc(cc3)-c3cc[nH]n3)c2C1=O |r|
Reactome pathway
US Patent
n/an/a 20n/an/an/an/an/an/a
ASTRAZENECA AB
US Patent
Assay Description
Compounds were tested in a competition binding assay using 3H-MK591 as tracer. (Preparation of MK-591 is described in Bioorg. Med. Chem. Lett. 1999, ...
US Patent US11001589 (2021)
5-lipoxygenase/FLAP
(Homo sapiens (Human))
BDBM323033
((1R,2R)-N-(5-Methyl-4-oxo-4,5,6,7- tetrahydropyraz...)
Show SMILES CN1CCn2ncc(NC(=O)[C@@H]3CCCC[C@H]3C(=O)c3ccc(cc3)-c3cc[nH]n3)c2C1=O |r|
Reactome pathway
US Patent
n/an/a 20n/an/an/an/an/an/a
ASTRAZENECA AB
US Patent
Assay Description
Compounds were tested in a competition binding assay using 3H-MK591 as tracer. (Preparation of MK-591 is described in Bioorg. Med. Chem. Lett. 1999, ...
US Patent US10508119 (2019)
BindingDB Entry DOI: 10.7270/Q2FB55BJ