BDBM323051 4-[({(1R,2R or 1S,2S)-2-[2-Fluoro-4-(1H- pyrazol-5-yl)benzoyl] cyclohexyl}carbonyl)amino]-1-methyl-1H- pyrazole-5-carboxamide::US10183947, Example 34::US10508119, Example 34
SMILES: Cn1ncc(NC(=O)C2CCCCC2C(=O)c2ccc(cc2F)-c2ccn[nH]2)c1C(N)=O
InChI Key:
Data: 2 IC50
Activity Spreadsheet -- Enzyme Inhibition Constant Data from BindingDB
Found 2 hits for monomerid = 323051
Trg + Lig
Ki
nM
ΔG°
kcal/mole
IC50
nM
Kd
nM
EC50/IC50
nM
koff
s-1
kon
M-1s-1
pHTemp
°C
5-lipoxygenase/FLAP
(Homo sapiens (Human))
BDBM323051
(4-[({(1R,2R or 1S,2S)-2-[2-Fluoro-4-(1H- pyrazol-5...)
Show SMILES Cn1ncc(NC(=O)C2CCCCC2C(=O)c2ccc(cc2F)-c2ccn[nH]2)c1C(N)=O |w:8.7,13.14|
Reactome pathway
US Patent
n/an/a 41n/an/an/an/an/an/a
ASTRAZENECA AB
US Patent
Assay Description
Compounds were tested in a competition binding assay using 3H-MK591 as tracer. (Preparation of MK-591 is described in Bioorg. Med. Chem. Lett. 1999, ...
US Patent US10508119 (2019)
BindingDB Entry DOI: 10.7270/Q2FB55BJ
Arachidonate 5-lipoxygenase
(Homo sapiens (Human))
BDBM323051
(4-[({(1R,2R or 1S,2S)-2-[2-Fluoro-4-(1H- pyrazol-5...)
Show SMILES Cn1ncc(NC(=O)C2CCCCC2C(=O)c2ccc(cc2F)-c2ccn[nH]2)c1C(N)=O |w:8.7,13.14|
Reactome pathway
US Patent
n/an/a 41n/an/an/an/an/an/a
ASTRAZENECA AB
US Patent
Assay Description
Compounds were tested in a competition binding assay using 3H-MK591 as tracer. (Preparation of MK-591 is described in Bioorg. Med. Chem. Lett. 1999, ...
US Patent US10183947 (2019)
BindingDB Entry DOI: 10.7270/Q22Z17M7