null
SMILES: Cc1cc([nH]n1)-c1ccc(C(=O)C2CCCCC2C(=O)Nc2cnn3CCNC(=O)c23)c(F)c1
InChI Key:
Activity Spreadsheet -- Enzyme Inhibition Constant Data from BindingDB
Found 2 hits for monomerid = 323056
Trg + Lig
Ki
nM
ΔG°
kcal/mole
IC50
nM
Kd
nM
EC50/IC50
nM
koff
s-1
kon
M-1s-1
pHTemp
°C
Arachidonate 5-lipoxygenase-activating protein
(Homo sapiens (Human))
BDBM323056
((1R,2R or 1S,2S)-2-[2-Fluoro-4-(3-methyl- 1H-pyraz...)
Show SMILES Cc1cc([nH]n1)-c1ccc(C(=O)C2CCCCC2C(=O)Nc2cnn3CCNC(=O)c23)c(F)c1 |w:17.19,12.12|
Reactome pathway
US Patent
n/an/a 9n/an/an/an/an/an/a
ASTRAZENECA AB
US Patent
Assay Description
Compounds were tested in a competition binding assay using 3H-MK591 as tracer. (Preparation of MK-591 is described in Bioorg. Med. Chem. Lett. 1999, ...
US Patent US10508119 (2019)
BindingDB Entry DOI: 10.7270/Q2FB55BJ
Polyunsaturated fatty acid 5-lipoxygenase
(Homo sapiens (Human))
BDBM323056
((1R,2R or 1S,2S)-2-[2-Fluoro-4-(3-methyl- 1H-pyraz...)
Show SMILES Cc1cc([nH]n1)-c1ccc(C(=O)C2CCCCC2C(=O)Nc2cnn3CCNC(=O)c23)c(F)c1 |w:17.19,12.12|
Reactome pathway
US Patent
n/an/a 9n/an/an/an/an/an/a
ASTRAZENECA AB
US Patent
Assay Description
Compounds were tested in a competition binding assay using 3H-MK591 as tracer. (Preparation of MK-591 is described in Bioorg. Med. Chem. Lett. 1999, ...
US Patent US10183947 (2019)
BindingDB Entry DOI: 10.7270/Q22Z17M7