null
SMILES: ONC(=O)\C=C\c1ccc(CNCC23CC4CC(CC(C4)C2)C3)c(F)c1
InChI Key: InChIKey=AZODTJZLKVAKDP-DUXPYHPUSA-N
Activity Spreadsheet -- Enzyme Inhibition Constant Data from BindingDB
Found 9 hits for monomerid = 323717
Trg + Lig
Ki
nM
ΔG°
kcal/mole
IC50
nM
Kd
nM
EC50/IC50
nM
koff
s-1
kon
M-1s-1
pHTemp
°C
Histone deacetylase 1
(Homo sapiens (Human))
BDBM323717
(US10188756, Compound CN148)
Show SMILES ONC(=O)\C=C\c1ccc(CNCC23CC4CC(CC(C4)C2)C3)c(F)c1 |TLB:16:17:21:15.20.14,20:15:22:21.19.18,20:19:22:15.16.14,THB:16:15:21:22.17.18|
Show InChI InChI=1S/C21H27FN2O2/c22-19-8-14(2-4-20(25)24-26)1-3-18(19)12-23-13-21-9-15-5-16(10-21)7-17(6-15)11-21/h1-4,8,15-17,23,26H,5-7,9-13H2,(H,24,25)/b4-2+
NCI pathway
Reactome pathway
US Patent
n/an/a 0.780n/an/an/an/an/an/a
The General Hospital Corporation
US Patent
Assay Description
All histone deacetylases were purchased from BPS Bioscience. The substrates, Broad Substrate A, and Broad Substrate B, were synthesized and are now a...
US Patent US10188756 (2019)
BindingDB Entry DOI: 10.7270/Q20Z75CX
Histone deacetylase 2
(Homo sapiens (Human))
BDBM323717
(US10188756, Compound CN148)
Show SMILES ONC(=O)\C=C\c1ccc(CNCC23CC4CC(CC(C4)C2)C3)c(F)c1 |TLB:16:17:21:15.20.14,20:15:22:21.19.18,20:19:22:15.16.14,THB:16:15:21:22.17.18|
Show InChI InChI=1S/C21H27FN2O2/c22-19-8-14(2-4-20(25)24-26)1-3-18(19)12-23-13-21-9-15-5-16(10-21)7-17(6-15)11-21/h1-4,8,15-17,23,26H,5-7,9-13H2,(H,24,25)/b4-2+
NCI pathway
Reactome pathway
US Patent
n/an/a 6.40n/an/an/an/an/an/a
The General Hospital Corporation
US Patent
Assay Description
All histone deacetylases were purchased from BPS Bioscience. The substrates, Broad Substrate A, and Broad Substrate B, were synthesized and are now a...
US Patent US10188756 (2019)
BindingDB Entry DOI: 10.7270/Q20Z75CX
Histone deacetylase 3
(Homo sapiens (Human))
BDBM323717
(US10188756, Compound CN148)
Show SMILES ONC(=O)\C=C\c1ccc(CNCC23CC4CC(CC(C4)C2)C3)c(F)c1 |TLB:16:17:21:15.20.14,20:15:22:21.19.18,20:19:22:15.16.14,THB:16:15:21:22.17.18|
Show InChI InChI=1S/C21H27FN2O2/c22-19-8-14(2-4-20(25)24-26)1-3-18(19)12-23-13-21-9-15-5-16(10-21)7-17(6-15)11-21/h1-4,8,15-17,23,26H,5-7,9-13H2,(H,24,25)/b4-2+
NCI pathway
Reactome pathway
US Patent
n/an/a 0.5n/an/an/an/an/an/a
The General Hospital Corporation
US Patent
Assay Description
All histone deacetylases were purchased from BPS Bioscience. The substrates, Broad Substrate A, and Broad Substrate B, were synthesized and are now a...
US Patent US10188756 (2019)
BindingDB Entry DOI: 10.7270/Q20Z75CX
Histone deacetylase 4
(Homo sapiens (Human))
BDBM323717
(US10188756, Compound CN148)
Show SMILES ONC(=O)\C=C\c1ccc(CNCC23CC4CC(CC(C4)C2)C3)c(F)c1 |TLB:16:17:21:15.20.14,20:15:22:21.19.18,20:19:22:15.16.14,THB:16:15:21:22.17.18|
Show InChI InChI=1S/C21H27FN2O2/c22-19-8-14(2-4-20(25)24-26)1-3-18(19)12-23-13-21-9-15-5-16(10-21)7-17(6-15)11-21/h1-4,8,15-17,23,26H,5-7,9-13H2,(H,24,25)/b4-2+
US Patent
n/an/a>7.00E+4n/an/an/an/an/an/a
The General Hospital Corporation
US Patent
Assay Description
All histone deacetylases were purchased from BPS Bioscience. The substrates, Broad Substrate A, and Broad Substrate B, were synthesized and are now a...
US Patent US10188756 (2019)
BindingDB Entry DOI: 10.7270/Q20Z75CX
Histone deacetylase 9
(Homo sapiens (Human))
BDBM323717
(US10188756, Compound CN148)
Show SMILES ONC(=O)\C=C\c1ccc(CNCC23CC4CC(CC(C4)C2)C3)c(F)c1 |TLB:16:17:21:15.20.14,20:15:22:21.19.18,20:19:22:15.16.14,THB:16:15:21:22.17.18|
Show InChI InChI=1S/C21H27FN2O2/c22-19-8-14(2-4-20(25)24-26)1-3-18(19)12-23-13-21-9-15-5-16(10-21)7-17(6-15)11-21/h1-4,8,15-17,23,26H,5-7,9-13H2,(H,24,25)/b4-2+
Reactome pathway
US Patent
n/an/a>5.00E+4n/an/an/an/an/an/a
The General Hospital Corporation
US Patent
Assay Description
All histone deacetylases were purchased from BPS Bioscience. The substrates, Broad Substrate A, and Broad Substrate B, were synthesized and are now a...
US Patent US10188756 (2019)
BindingDB Entry DOI: 10.7270/Q20Z75CX
Histone deacetylase 6
(Homo sapiens (Human))
BDBM323717
(US10188756, Compound CN148)
Show SMILES ONC(=O)\C=C\c1ccc(CNCC23CC4CC(CC(C4)C2)C3)c(F)c1 |TLB:16:17:21:15.20.14,20:15:22:21.19.18,20:19:22:15.16.14,THB:16:15:21:22.17.18|
Show InChI InChI=1S/C21H27FN2O2/c22-19-8-14(2-4-20(25)24-26)1-3-18(19)12-23-13-21-9-15-5-16(10-21)7-17(6-15)11-21/h1-4,8,15-17,23,26H,5-7,9-13H2,(H,24,25)/b4-2+
NCI pathway
Reactome pathway
US Patent
n/an/a 9.5n/an/an/an/an/an/a
The General Hospital Corporation
US Patent
Assay Description
All histone deacetylases were purchased from BPS Bioscience. The substrates, Broad Substrate A, and Broad Substrate B, were synthesized and are now a...
US Patent US10188756 (2019)
BindingDB Entry DOI: 10.7270/Q20Z75CX
Histone deacetylase 7
(Homo sapiens (Human))
BDBM323717
(US10188756, Compound CN148)
Show SMILES ONC(=O)\C=C\c1ccc(CNCC23CC4CC(CC(C4)C2)C3)c(F)c1 |TLB:16:17:21:15.20.14,20:15:22:21.19.18,20:19:22:15.16.14,THB:16:15:21:22.17.18|
Show InChI InChI=1S/C21H27FN2O2/c22-19-8-14(2-4-20(25)24-26)1-3-18(19)12-23-13-21-9-15-5-16(10-21)7-17(6-15)11-21/h1-4,8,15-17,23,26H,5-7,9-13H2,(H,24,25)/b4-2+
NCI pathway
Reactome pathway
US Patent
n/an/a>5.00E+4n/an/an/an/an/an/a
The General Hospital Corporation
US Patent
Assay Description
All histone deacetylases were purchased from BPS Bioscience. The substrates, Broad Substrate A, and Broad Substrate B, were synthesized and are now a...
US Patent US10188756 (2019)
BindingDB Entry DOI: 10.7270/Q20Z75CX
Histone deacetylase 8
(Homo sapiens (Human))
BDBM323717
(US10188756, Compound CN148)
Show SMILES ONC(=O)\C=C\c1ccc(CNCC23CC4CC(CC(C4)C2)C3)c(F)c1 |TLB:16:17:21:15.20.14,20:15:22:21.19.18,20:19:22:15.16.14,THB:16:15:21:22.17.18|
Show InChI InChI=1S/C21H27FN2O2/c22-19-8-14(2-4-20(25)24-26)1-3-18(19)12-23-13-21-9-15-5-16(10-21)7-17(6-15)11-21/h1-4,8,15-17,23,26H,5-7,9-13H2,(H,24,25)/b4-2+
NCI pathway
Reactome pathway
US Patent
n/an/a 4.90E+3n/an/an/an/an/an/a
The General Hospital Corporation
US Patent
Assay Description
All histone deacetylases were purchased from BPS Bioscience. The substrates, Broad Substrate A, and Broad Substrate B, were synthesized and are now a...
US Patent US10188756 (2019)
BindingDB Entry DOI: 10.7270/Q20Z75CX
Histone deacetylase 5
(Homo sapiens (Human))
BDBM323717
(US10188756, Compound CN148)
Show SMILES ONC(=O)\C=C\c1ccc(CNCC23CC4CC(CC(C4)C2)C3)c(F)c1 |TLB:16:17:21:15.20.14,20:15:22:21.19.18,20:19:22:15.16.14,THB:16:15:21:22.17.18|
Show InChI InChI=1S/C21H27FN2O2/c22-19-8-14(2-4-20(25)24-26)1-3-18(19)12-23-13-21-9-15-5-16(10-21)7-17(6-15)11-21/h1-4,8,15-17,23,26H,5-7,9-13H2,(H,24,25)/b4-2+
US Patent
n/an/a 4.31E+3n/an/an/an/an/an/a
The General Hospital Corporation
US Patent
Assay Description
All histone deacetylases were purchased from BPS Bioscience. The substrates, Broad Substrate A, and Broad Substrate B, were synthesized and are now a...
US Patent US10188756 (2019)
BindingDB Entry DOI: 10.7270/Q20Z75CX