null
SMILES: Cc1cc2nc([nH]c2cc1C)C(CNC(=O)c1ccc(cc1Cl)-n1cnnc1)c1cccc(F)c1
InChI Key:
Activity Spreadsheet -- Enzyme Inhibition Constant Data from BindingDB
Found 1 hit for monomerid = 324213
Trg + Lig
Ki
nM
ΔG°
kcal/mole
IC50
nM
Kd
nM
EC50/IC50
nM
koff
s-1
kon
M-1s-1
pHTemp
°C
Coagulation factor IX
(Homo sapiens (Human))
BDBM324213
(US10189819, Example 50)
Show SMILES Cc1cc2nc([nH]c2cc1C)C(CNC(=O)c1ccc(cc1Cl)-n1cnnc1)c1cccc(F)c1
Reactome pathway
US Patent
n/an/a 5.69n/an/an/an/an/an/a
Merck Sharp & Dohme, Corp.; Mochida Paraceuticals Co., Ltd.
US Patent
Assay Description
Formation of a clot to stem bleeding at a site of blood vessel injury involves the coordinated activity of a group of plasma proteins that initiate a...
US Patent US10189819 (2019)
BindingDB Entry DOI: 10.7270/Q200046Z