BDBM324250 US10189819, Example 104
SMILES: OC(=O)c1ccc2ncn(-c3ccc(C(=O)NCC(c4cccc(F)c4)c4nc5c(F)ccc(Cl)c5c(=O)[nH]4)c(Cl)c3)c2c1
InChI Key:
Data: 1 IC50
Activity Spreadsheet -- Enzyme Inhibition Constant Data from BindingDB
Found 1 hit for monomerid = 324250
Trg + Lig
Ki
nM
ΔG°
kcal/mole
IC50
nM
Kd
nM
EC50/IC50
nM
koff
s-1
kon
M-1s-1
pHTemp
°C
Coagulation factor IX
(Homo sapiens (Human))
BDBM324250
(US10189819, Example 104)
Show SMILES OC(=O)c1ccc2ncn(-c3ccc(C(=O)NCC(c4cccc(F)c4)c4nc5c(F)ccc(Cl)c5c(=O)[nH]4)c(Cl)c3)c2c1
Reactome pathway
US Patent
n/an/a 1.97n/an/an/an/an/an/a
Merck Sharp & Dohme, Corp.; Mochida Paraceuticals Co., Ltd.
US Patent
Assay Description
Formation of a clot to stem bleeding at a site of blood vessel injury involves the coordinated activity of a group of plasma proteins that initiate a...
US Patent US10189819 (2019)
BindingDB Entry DOI: 10.7270/Q200046Z