BDBM324798 9-(4-(2H-1,2,3-triazol-2-::US10189841, Compound I-4::US10399980, Compound I-4
SMILES: FC(F)Oc1ncccc1-c1ncc2[nH]c(=O)n(Cc3ccc(cc3)-n3nccn3)c2n1
InChI Key: InChIKey=LSEGNYKXAIGRRB-UHFFFAOYSA-N
Data: 2 IC50
Activity Spreadsheet -- Enzyme Inhibition Constant Data from BindingDB
Found 2 hits for monomerid = 324798
Trg + Lig
Ki
nM
ΔG°
kcal/mole
IC50
nM
Kd
nM
EC50/IC50
nM
koff
s-1
kon
M-1s-1
pHTemp
°C
Ubiquitin carboxyl-terminal hydrolase 1
(Homo sapiens (Human))
BDBM324798
(9-(4-(2H-1,2,3-triazol-2- | US10189841, Compound I...)
Show SMILES FC(F)Oc1ncccc1-c1ncc2[nH]c(=O)n(Cc3ccc(cc3)-n3nccn3)c2n1
Show InChI InChI=1S/C20H14F2N8O2/c21-19(22)32-18-14(2-1-7-23-18)16-24-10-15-17(28-16)29(20(31)27-15)11-12-3-5-13(6-4-12)30-25-8-9-26-30/h1-10,19H,11H2,(H,27,31)
US Patent
n/an/a>2.00E+3n/an/an/an/an/an/a
FORMA Therapeutics, Inc.
US Patent
Assay Description
The HTS assay was performed in a final volume of 20 μL in assay buffer containing 20 mM Tris-HCl (pH 8.0, (1M Tris-HCl, pH 8.0 solution; Corning...
US Patent US10399980 (2019)
BindingDB Entry DOI: 10.7270/Q23J3GCX
Ubiquitin carboxyl-terminal hydrolase 1
(Homo sapiens (Human))
BDBM324798
(9-(4-(2H-1,2,3-triazol-2- | US10189841, Compound I...)
Show SMILES FC(F)Oc1ncccc1-c1ncc2[nH]c(=O)n(Cc3ccc(cc3)-n3nccn3)c2n1
Show InChI InChI=1S/C20H14F2N8O2/c21-19(22)32-18-14(2-1-7-23-18)16-24-10-15-17(28-16)29(20(31)27-15)11-12-3-5-13(6-4-12)30-25-8-9-26-30/h1-10,19H,11H2,(H,27,31)
US Patent
n/an/a<0.00200n/an/an/an/an/an/a
FORMA Therapeutics, Inc.
US Patent
Assay Description
The HTS assay was performed in a final volume of 20 μL in assay buffer containing 20 mM Tris-HCl (pH 8.0, (1M Tris-HCl, pH 8.0 solution; Corning...
US Patent US10189841 (2019)
BindingDB Entry DOI: 10.7270/Q22R3TRR