BDBM324977 2-(2-isopropylphenyl)-9-(4-::US10189841, Compound I-183::US10399980, Compound I-183
SMILES: CC(C)c1ccccc1-c1ncc2[nH]c(=O)n(Cc3ccc(cc3)S(C)(=O)=O)c2n1
InChI Key: InChIKey=RGFOKPWAPZBONW-UHFFFAOYSA-N
Data: 2 IC50
Activity Spreadsheet -- Enzyme Inhibition Constant Data from BindingDB
Found 2 hits for monomerid = 324977
Trg + Lig
Ki
nM
ΔG°
kcal/mole
IC50
nM
Kd
nM
EC50/IC50
nM
koff
s-1
kon
M-1s-1
pHTemp
°C
Ubiquitin carboxyl-terminal hydrolase 1
(Homo sapiens (Human))
BDBM324977
(2-(2-isopropylphenyl)-9-(4- | US10189841, Compound...)
Show SMILES CC(C)c1ccccc1-c1ncc2[nH]c(=O)n(Cc3ccc(cc3)S(C)(=O)=O)c2n1
Show InChI InChI=1S/C22H22N4O3S/c1-14(2)17-6-4-5-7-18(17)20-23-12-19-21(25-20)26(22(27)24-19)13-15-8-10-16(11-9-15)30(3,28)29/h4-12,14H,13H2,1-3H3,(H,24,27)
US Patent
n/an/a>2.00E+3n/an/an/an/an/an/a
FORMA Therapeutics, Inc.
US Patent
Assay Description
The HTS assay was performed in a final volume of 20 μL in assay buffer containing 20 mM Tris-HCl (pH 8.0, (1M Tris-HCl, pH 8.0 solution; Corning...
US Patent US10399980 (2019)
BindingDB Entry DOI: 10.7270/Q23J3GCX
Ubiquitin carboxyl-terminal hydrolase 1
(Homo sapiens (Human))
BDBM324977
(2-(2-isopropylphenyl)-9-(4- | US10189841, Compound...)
Show SMILES CC(C)c1ccccc1-c1ncc2[nH]c(=O)n(Cc3ccc(cc3)S(C)(=O)=O)c2n1
Show InChI InChI=1S/C22H22N4O3S/c1-14(2)17-6-4-5-7-18(17)20-23-12-19-21(25-20)26(22(27)24-19)13-15-8-10-16(11-9-15)30(3,28)29/h4-12,14H,13H2,1-3H3,(H,24,27)
US Patent
n/an/a<0.00200n/an/an/an/an/an/a
FORMA Therapeutics, Inc.
US Patent
Assay Description
The HTS assay was performed in a final volume of 20 μL in assay buffer containing 20 mM Tris-HCl (pH 8.0, (1M Tris-HCl, pH 8.0 solution; Corning...
US Patent US10189841 (2019)
BindingDB Entry DOI: 10.7270/Q22R3TRR