BDBM3252 (1R,2R)-2-[(4-hydroxybenzene)amido]cyclopentyl 3,5-dihydroxy-4-[2-hydroxy-6-(methoxycarbonyl)phenoxy]benzoate::Balanol Benzophenone Ester Analog (-)8
SMILES: COC(=O)c1cccc(O)c1Oc1c(O)cc(cc1O)C(=O)O[C@@H]1CCC[C@H]1NC(=O)c1ccc(O)cc1
InChI Key: InChIKey=YRTMRGPNXUUDTD-XMSQKQJNSA-N
Data: 5 IC50
Activity Spreadsheet -- Enzyme Inhibition Constant Data from BindingDB
Found 5 hits for monomerid = 3252
Trg + Lig
Ki
nM
ΔG°
kcal/mole
IC50
nM
Kd
nM
EC50/IC50
nM
koff
s-1
kon
M-1s-1
pHTemp
°C
Protein kinase C alpha type
(Homo sapiens (Human))
BDBM3252
((1R,2R)-2-[(4-hydroxybenzene)amido]cyclopentyl 3,5...)
Show SMILES COC(=O)c1cccc(O)c1Oc1c(O)cc(cc1O)C(=O)O[C@@H]1CCC[C@H]1NC(=O)c1ccc(O)cc1 |r|
Show InChI InChI=1S/C27H25NO10/c1-36-27(35)17-4-2-6-19(30)23(17)38-24-20(31)12-15(13-21(24)32)26(34)37-22-7-3-5-18(22)28-25(33)14-8-10-16(29)11-9-14/h2,4,6,8-13,18,22,29-32H,3,5,7H2,1H3,(H,28,33)/t18-,22-/m1/s1
NCI pathway
Reactome pathway
n/an/a 210n/an/an/an/an/an/a
Sphinx Pharmaceuticals
Assay Description
The activity of PKC, activated by phosphatidylerine and Ca2+, is measured by its ability to transfer phosphate from [gamma-32P]ATP to lysine-rich his...
Bioorg Med Chem Lett 5: 2133-8 (1995)
Article DOI: 10.1016/0960-894X(95)00361-V
BindingDB Entry DOI: 10.7270/Q26T0JT4
PKC alpha and beta-2
(Homo sapiens (Human))
BDBM3252
((1R,2R)-2-[(4-hydroxybenzene)amido]cyclopentyl 3,5...)
Show SMILES COC(=O)c1cccc(O)c1Oc1c(O)cc(cc1O)C(=O)O[C@@H]1CCC[C@H]1NC(=O)c1ccc(O)cc1 |r|
Show InChI InChI=1S/C27H25NO10/c1-36-27(35)17-4-2-6-19(30)23(17)38-24-20(31)12-15(13-21(24)32)26(34)37-22-7-3-5-18(22)28-25(33)14-8-10-16(29)11-9-14/h2,4,6,8-13,18,22,29-32H,3,5,7H2,1H3,(H,28,33)/t18-,22-/m1/s1
NCI pathway
Reactome pathway
n/an/a 40n/an/an/an/an/an/a
Sphinx Pharmaceuticals
Assay Description
The activity of PKC, activated by phosphatidylerine and Ca2+, is measured by its ability to transfer phosphate from [gamma-32P]ATP to lysine-rich his...
Bioorg Med Chem Lett 5: 2133-8 (1995)
Article DOI: 10.1016/0960-894X(95)00361-V
BindingDB Entry DOI: 10.7270/Q26T0JT4
Protein kinase C, eta
(Homo sapiens (Human))
BDBM3252
((1R,2R)-2-[(4-hydroxybenzene)amido]cyclopentyl 3,5...)
Show SMILES COC(=O)c1cccc(O)c1Oc1c(O)cc(cc1O)C(=O)O[C@@H]1CCC[C@H]1NC(=O)c1ccc(O)cc1 |r|
Show InChI InChI=1S/C27H25NO10/c1-36-27(35)17-4-2-6-19(30)23(17)38-24-20(31)12-15(13-21(24)32)26(34)37-22-7-3-5-18(22)28-25(33)14-8-10-16(29)11-9-14/h2,4,6,8-13,18,22,29-32H,3,5,7H2,1H3,(H,28,33)/t18-,22-/m1/s1
NCI pathway
Reactome pathway
n/an/a 4n/an/an/an/an/an/a
Sphinx Pharmaceuticals
Assay Description
The activity of PKC, activated by phosphatidylerine and Ca2+, is measured by its ability to transfer phosphate from [gamma-32P]ATP to lysine-rich his...
Bioorg Med Chem Lett 5: 2133-8 (1995)
Article DOI: 10.1016/0960-894X(95)00361-V
BindingDB Entry DOI: 10.7270/Q26T0JT4
Protein kinase C, epsilon
(Homo sapiens (Human))
BDBM3252
((1R,2R)-2-[(4-hydroxybenzene)amido]cyclopentyl 3,5...)
Show SMILES COC(=O)c1cccc(O)c1Oc1c(O)cc(cc1O)C(=O)O[C@@H]1CCC[C@H]1NC(=O)c1ccc(O)cc1 |r|
Show InChI InChI=1S/C27H25NO10/c1-36-27(35)17-4-2-6-19(30)23(17)38-24-20(31)12-15(13-21(24)32)26(34)37-22-7-3-5-18(22)28-25(33)14-8-10-16(29)11-9-14/h2,4,6,8-13,18,22,29-32H,3,5,7H2,1H3,(H,28,33)/t18-,22-/m1/s1
NCI pathway
Reactome pathway
n/an/a 300n/an/an/an/an/an/a
Sphinx Pharmaceuticals
Assay Description
The activity of PKC, activated by phosphatidylerine and Ca2+, is measured by its ability to transfer phosphate from [gamma-32P]ATP to lysine-rich his...
Bioorg Med Chem Lett 5: 2133-8 (1995)
Article DOI: 10.1016/0960-894X(95)00361-V
BindingDB Entry DOI: 10.7270/Q26T0JT4
Protein kinase C delta type
(Homo sapiens (Human))
BDBM3252
((1R,2R)-2-[(4-hydroxybenzene)amido]cyclopentyl 3,5...)
Show SMILES COC(=O)c1cccc(O)c1Oc1c(O)cc(cc1O)C(=O)O[C@@H]1CCC[C@H]1NC(=O)c1ccc(O)cc1 |r|
Show InChI InChI=1S/C27H25NO10/c1-36-27(35)17-4-2-6-19(30)23(17)38-24-20(31)12-15(13-21(24)32)26(34)37-22-7-3-5-18(22)28-25(33)14-8-10-16(29)11-9-14/h2,4,6,8-13,18,22,29-32H,3,5,7H2,1H3,(H,28,33)/t18-,22-/m1/s1
NCI pathway
Reactome pathway
n/an/a 5n/an/an/an/an/an/a
Sphinx Pharmaceuticals
Assay Description
The activity of PKC, activated by phosphatidylerine and Ca2+, is measured by its ability to transfer phosphate from [gamma-32P]ATP to lysine-rich his...
Bioorg Med Chem Lett 5: 2133-8 (1995)
Article DOI: 10.1016/0960-894X(95)00361-V
BindingDB Entry DOI: 10.7270/Q26T0JT4