BDBM325204 2-(2-isopropylphenyl)-9-(4-(4-methylpiperazine-1-::US10189841, Compound I-410::US10399980, Compound I-410
SMILES: CC(C)c1ccccc1-c1ncc2[nH]c(=O)n(Cc3ccc(cc3)C(=O)N3CCN(C)CC3)c2n1
InChI Key: InChIKey=DGJVUUCZIQZXLX-UHFFFAOYSA-N
Data: 2 IC50
Activity Spreadsheet -- Enzyme Inhibition Constant Data from BindingDB
Found 2 hits for monomerid = 325204
Trg + Lig
Ki
nM
ΔG°
kcal/mole
IC50
nM
Kd
nM
EC50/IC50
nM
koff
s-1
kon
M-1s-1
pHTemp
°C
Ubiquitin carboxyl-terminal hydrolase 1
(Homo sapiens (Human))
BDBM325204
(2-(2-isopropylphenyl)-9-(4-(4-methylpiperazine-1- ...)
Show SMILES CC(C)c1ccccc1-c1ncc2[nH]c(=O)n(Cc3ccc(cc3)C(=O)N3CCN(C)CC3)c2n1
Show InChI InChI=1S/C27H30N6O2/c1-18(2)21-6-4-5-7-22(21)24-28-16-23-25(30-24)33(27(35)29-23)17-19-8-10-20(11-9-19)26(34)32-14-12-31(3)13-15-32/h4-11,16,18H,12-15,17H2,1-3H3,(H,29,35)
US Patent
n/an/a>2.00E+3n/an/an/an/an/an/a
FORMA Therapeutics, Inc.
US Patent
Assay Description
The HTS assay was performed in a final volume of 20 μL in assay buffer containing 20 mM Tris-HCl (pH 8.0, (1M Tris-HCl, pH 8.0 solution; Corning...
US Patent US10399980 (2019)
BindingDB Entry DOI: 10.7270/Q23J3GCX
Ubiquitin carboxyl-terminal hydrolase 1
(Homo sapiens (Human))
BDBM325204
(2-(2-isopropylphenyl)-9-(4-(4-methylpiperazine-1- ...)
Show SMILES CC(C)c1ccccc1-c1ncc2[nH]c(=O)n(Cc3ccc(cc3)C(=O)N3CCN(C)CC3)c2n1
Show InChI InChI=1S/C27H30N6O2/c1-18(2)21-6-4-5-7-22(21)24-28-16-23-25(30-24)33(27(35)29-23)17-19-8-10-20(11-9-19)26(34)32-14-12-31(3)13-15-32/h4-11,16,18H,12-15,17H2,1-3H3,(H,29,35)
US Patent
n/an/a<0.00200n/an/an/an/an/an/a
FORMA Therapeutics, Inc.
US Patent
Assay Description
The HTS assay was performed in a final volume of 20 μL in assay buffer containing 20 mM Tris-HCl (pH 8.0, (1M Tris-HCl, pH 8.0 solution; Corning...
US Patent US10189841 (2019)
BindingDB Entry DOI: 10.7270/Q22R3TRR