BDBM325269 9-((4-fluoro-1-::US10189841, Compound I-475::US10399980, Compound I-475
SMILES: CC(C)C(=O)N1CCC(F)(Cn2c3nc(ncc3[nH]c2=O)-c2ccccc2C(C)C)CC1
InChI Key: InChIKey=MEWSEYHQHCSYIE-UHFFFAOYSA-N
Data: 2 IC50
Activity Spreadsheet -- Enzyme Inhibition Constant Data from BindingDB
Found 2 hits for monomerid = 325269
Trg + Lig
Ki
nM
ΔG°
kcal/mole
IC50
nM
Kd
nM
EC50/IC50
nM
koff
s-1
kon
M-1s-1
pHTemp
°C
Ubiquitin carboxyl-terminal hydrolase 1
(Homo sapiens (Human))
BDBM325269
(9-((4-fluoro-1- | US10189841, Compound I-475 | US1...)
Show SMILES CC(C)C(=O)N1CCC(F)(Cn2c3nc(ncc3[nH]c2=O)-c2ccccc2C(C)C)CC1
Show InChI InChI=1S/C24H30FN5O2/c1-15(2)17-7-5-6-8-18(17)20-26-13-19-21(28-20)30(23(32)27-19)14-24(25)9-11-29(12-10-24)22(31)16(3)4/h5-8,13,15-16H,9-12,14H2,1-4H3,(H,27,32)
US Patent
n/an/a>2.00E+3n/an/an/an/an/an/a
FORMA Therapeutics, Inc.
US Patent
Assay Description
The HTS assay was performed in a final volume of 20 μL in assay buffer containing 20 mM Tris-HCl (pH 8.0, (1M Tris-HCl, pH 8.0 solution; Corning...
US Patent US10399980 (2019)
BindingDB Entry DOI: 10.7270/Q23J3GCX
Ubiquitin carboxyl-terminal hydrolase 1
(Homo sapiens (Human))
BDBM325269
(9-((4-fluoro-1- | US10189841, Compound I-475 | US1...)
Show SMILES CC(C)C(=O)N1CCC(F)(Cn2c3nc(ncc3[nH]c2=O)-c2ccccc2C(C)C)CC1
Show InChI InChI=1S/C24H30FN5O2/c1-15(2)17-7-5-6-8-18(17)20-26-13-19-21(28-20)30(23(32)27-19)14-24(25)9-11-29(12-10-24)22(31)16(3)4/h5-8,13,15-16H,9-12,14H2,1-4H3,(H,27,32)
US Patent
n/an/a<0.00200n/an/an/an/an/an/a
FORMA Therapeutics, Inc.
US Patent
Assay Description
The HTS assay was performed in a final volume of 20 μL in assay buffer containing 20 mM Tris-HCl (pH 8.0, (1M Tris-HCl, pH 8.0 solution; Corning...
US Patent US10189841 (2019)
BindingDB Entry DOI: 10.7270/Q22R3TRR