BDBM325296 US10189841, Compound I-502::US10399980, Compound I-502
SMILES: CC(C)c1ccccc1-c1ncc2[nH]c(=O)n(CC3CN(C3)c3nccc(n3)C(F)(F)F)c2n1
InChI Key: InChIKey=XBVAKLMIEUXVEC-UHFFFAOYSA-N
Data: 2 IC50
Activity Spreadsheet -- Enzyme Inhibition Constant Data from BindingDB
Found 2 hits for monomerid = 325296
Trg + Lig
Ki
nM
ΔG°
kcal/mole
IC50
nM
Kd
nM
EC50/IC50
nM
koff
s-1
kon
M-1s-1
pHTemp
°C
Ubiquitin carboxyl-terminal hydrolase 1
(Homo sapiens (Human))
BDBM325296
(US10189841, Compound I-502 | US10399980, Compound ...)
Show SMILES CC(C)c1ccccc1-c1ncc2[nH]c(=O)n(CC3CN(C3)c3nccc(n3)C(F)(F)F)c2n1
Show InChI InChI=1S/C23H22F3N7O/c1-13(2)15-5-3-4-6-16(15)19-28-9-17-20(31-19)33(22(34)29-17)12-14-10-32(11-14)21-27-8-7-18(30-21)23(24,25)26/h3-9,13-14H,10-12H2,1-2H3,(H,29,34)
US Patent
n/an/a>2.00E+3n/an/an/an/an/an/a
FORMA Therapeutics, Inc.
US Patent
Assay Description
The HTS assay was performed in a final volume of 20 μL in assay buffer containing 20 mM Tris-HCl (pH 8.0, (1M Tris-HCl, pH 8.0 solution; Corning...
US Patent US10399980 (2019)
BindingDB Entry DOI: 10.7270/Q23J3GCX
Ubiquitin carboxyl-terminal hydrolase 1
(Homo sapiens (Human))
BDBM325296
(US10189841, Compound I-502 | US10399980, Compound ...)
Show SMILES CC(C)c1ccccc1-c1ncc2[nH]c(=O)n(CC3CN(C3)c3nccc(n3)C(F)(F)F)c2n1
Show InChI InChI=1S/C23H22F3N7O/c1-13(2)15-5-3-4-6-16(15)19-28-9-17-20(31-19)33(22(34)29-17)12-14-10-32(11-14)21-27-8-7-18(30-21)23(24,25)26/h3-9,13-14H,10-12H2,1-2H3,(H,29,34)
US Patent
n/an/a<0.00200n/an/an/an/an/an/a
FORMA Therapeutics, Inc.
US Patent
Assay Description
The HTS assay was performed in a final volume of 20 μL in assay buffer containing 20 mM Tris-HCl (pH 8.0, (1M Tris-HCl, pH 8.0 solution; Corning...
US Patent US10189841 (2019)
BindingDB Entry DOI: 10.7270/Q22R3TRR