null
SMILES: CCC(CC)n1cc(cn1)-c1nc(cn2nccc12)-c1cnn(CC(O)C(C)C)c1
InChI Key: InChIKey=SOHKNIOEGMHCFT-UHFFFAOYSA-N
Activity Spreadsheet -- Enzyme Inhibition Constant Data from BindingDB
Found 12 hits for monomerid = 325451
Trg + Lig
Ki
nM
ΔG°
kcal/mole
IC50
nM
Kd
nM
EC50/IC50
nM
koff
s-1
kon
M-1s-1
pHTemp
°C
Non-receptor tyrosine-protein kinase TYK2
(Homo sapiens (Human))
BDBM325451
(3-methyl-1-(4-(4-(1- (pentan-3-yl)-1H-pyrazol- 4-y...)
Show SMILES CCC(CC)n1cc(cn1)-c1nc(cn2nccc12)-c1cnn(CC(O)C(C)C)c1
Show InChI InChI=1S/C22H29N7O/c1-5-18(6-2)28-12-17(10-25-28)22-20-7-8-23-29(20)13-19(26-22)16-9-24-27(11-16)14-21(30)15(3)4/h7-13,15,18,21,30H,5-6,14H2,1-4H3
US Patent
n/an/a 55n/an/an/an/an/an/a
Array BioPharma Inc.
US Patent
Assay Description
Compounds of Formula I were screened for their ability to inhibit Tyk2 using the general enzyme inhibition assay method, in which the assay mixture c...
US Patent US10189845 (2019)
BindingDB Entry DOI: 10.7270/Q2Z03B7Q
Tyrosine-protein kinase JAK1
(Homo sapiens (Human))
BDBM325451
(3-methyl-1-(4-(4-(1- (pentan-3-yl)-1H-pyrazol- 4-y...)
Show SMILES CCC(CC)n1cc(cn1)-c1nc(cn2nccc12)-c1cnn(CC(O)C(C)C)c1
Show InChI InChI=1S/C22H29N7O/c1-5-18(6-2)28-12-17(10-25-28)22-20-7-8-23-29(20)13-19(26-22)16-9-24-27(11-16)14-21(30)15(3)4/h7-13,15,18,21,30H,5-6,14H2,1-4H3
Reactome pathway
US Patent
n/an/a 550n/an/an/an/an/an/a
Array BioPharma Inc.
US Patent
Assay Description
Compounds of Formula I were screened for their ability to inhibit JAK1 using the general enzyme inhibition assay method, in which the assay mixture c...
US Patent US10189845 (2019)
BindingDB Entry DOI: 10.7270/Q2Z03B7Q
Tyrosine-protein kinase JAK2
(Homo sapiens (Human))
BDBM325451
(3-methyl-1-(4-(4-(1- (pentan-3-yl)-1H-pyrazol- 4-y...)
Show SMILES CCC(CC)n1cc(cn1)-c1nc(cn2nccc12)-c1cnn(CC(O)C(C)C)c1
Show InChI InChI=1S/C22H29N7O/c1-5-18(6-2)28-12-17(10-25-28)22-20-7-8-23-29(20)13-19(26-22)16-9-24-27(11-16)14-21(30)15(3)4/h7-13,15,18,21,30H,5-6,14H2,1-4H3
Reactome pathway
US Patent
n/an/a 55n/an/an/an/an/an/a
Array BioPharma Inc.
US Patent
Assay Description
Compounds of Formula I were screened for their ability to inhibit JAK2 using the general enzyme inhibition assay method, in which the assay mixture c...
US Patent US10189845 (2019)
BindingDB Entry DOI: 10.7270/Q2Z03B7Q
Tyrosine-protein kinase JAK3
(Homo sapiens (Human))
BDBM325451
(3-methyl-1-(4-(4-(1- (pentan-3-yl)-1H-pyrazol- 4-y...)
Show SMILES CCC(CC)n1cc(cn1)-c1nc(cn2nccc12)-c1cnn(CC(O)C(C)C)c1
Show InChI InChI=1S/C22H29N7O/c1-5-18(6-2)28-12-17(10-25-28)22-20-7-8-23-29(20)13-19(26-22)16-9-24-27(11-16)14-21(30)15(3)4/h7-13,15,18,21,30H,5-6,14H2,1-4H3
Reactome pathway
US Patent
n/an/a 5.50E+3n/an/an/an/an/an/a
Array BioPharma Inc.
US Patent
Assay Description
Compounds of Formula I were screened for their ability to inhibit JAK3 using the general enzyme inhibition assay method, in which the assay mixture c...
US Patent US10189845 (2019)
BindingDB Entry DOI: 10.7270/Q2Z03B7Q
Non-receptor tyrosine-protein kinase TYK2
(Homo sapiens (Human))
BDBM325451
(3-methyl-1-(4-(4-(1- (pentan-3-yl)-1H-pyrazol- 4-y...)
Show SMILES CCC(CC)n1cc(cn1)-c1nc(cn2nccc12)-c1cnn(CC(O)C(C)C)c1
Show InChI InChI=1S/C22H29N7O/c1-5-18(6-2)28-12-17(10-25-28)22-20-7-8-23-29(20)13-19(26-22)16-9-24-27(11-16)14-21(30)15(3)4/h7-13,15,18,21,30H,5-6,14H2,1-4H3
US Patent
n/an/a 55n/an/an/an/an/an/a
Array BioPharma Inc.; Celgene Corporation
US Patent
Assay Description
Compounds of Formula I were screened for their ability to inhibit Tyk2 using the general enzyme inhibition assay method, in which the assay mixture c...
US Patent US10730880 (2020)
BindingDB Entry DOI: 10.7270/Q2CC13R9
Tyrosine-protein kinase JAK3
(Homo sapiens (Human))
BDBM325451
(3-methyl-1-(4-(4-(1- (pentan-3-yl)-1H-pyrazol- 4-y...)
Show SMILES CCC(CC)n1cc(cn1)-c1nc(cn2nccc12)-c1cnn(CC(O)C(C)C)c1
Show InChI InChI=1S/C22H29N7O/c1-5-18(6-2)28-12-17(10-25-28)22-20-7-8-23-29(20)13-19(26-22)16-9-24-27(11-16)14-21(30)15(3)4/h7-13,15,18,21,30H,5-6,14H2,1-4H3
Reactome pathway
US Patent
n/an/a 5.50E+3n/an/an/an/an/an/a
ARRAY BIOPHARMA INC.; CELGENE CORPORATION
US Patent
Assay Description
Compounds of Formula I were screened for their ability to inhibit JAK3 using the general enzyme inhibition assay method, in which the assay mixture c...
US Patent US11028093 (2021)
BindingDB Entry DOI: 10.7270/Q2T156RN
Tyrosine-protein kinase JAK2
(Homo sapiens (Human))
BDBM325451
(3-methyl-1-(4-(4-(1- (pentan-3-yl)-1H-pyrazol- 4-y...)
Show SMILES CCC(CC)n1cc(cn1)-c1nc(cn2nccc12)-c1cnn(CC(O)C(C)C)c1
Show InChI InChI=1S/C22H29N7O/c1-5-18(6-2)28-12-17(10-25-28)22-20-7-8-23-29(20)13-19(26-22)16-9-24-27(11-16)14-21(30)15(3)4/h7-13,15,18,21,30H,5-6,14H2,1-4H3
Reactome pathway
US Patent
n/an/a 550n/an/an/an/an/an/a
Array BioPharma Inc.; Celgene Corporation
US Patent
Assay Description
Compounds of Formula I were screened for their ability to inhibit JAK2 using the general enzyme inhibition assay method, in which the assay mixture c...
US Patent US10730880 (2020)
BindingDB Entry DOI: 10.7270/Q2CC13R9
Tyrosine-protein kinase JAK3
(Homo sapiens (Human))
BDBM325451
(3-methyl-1-(4-(4-(1- (pentan-3-yl)-1H-pyrazol- 4-y...)
Show SMILES CCC(CC)n1cc(cn1)-c1nc(cn2nccc12)-c1cnn(CC(O)C(C)C)c1
Show InChI InChI=1S/C22H29N7O/c1-5-18(6-2)28-12-17(10-25-28)22-20-7-8-23-29(20)13-19(26-22)16-9-24-27(11-16)14-21(30)15(3)4/h7-13,15,18,21,30H,5-6,14H2,1-4H3
Reactome pathway
US Patent
n/an/a 5.50E+3n/an/an/an/an/an/a
Array BioPharma Inc.; Celgene Corporation
US Patent
Assay Description
Compounds of Formula I were screened for their ability to inhibit JAK3 using the general enzyme inhibition assay method, in which the assay mixture c...
US Patent US10730880 (2020)
BindingDB Entry DOI: 10.7270/Q2CC13R9
Non-receptor tyrosine-protein kinase TYK2
(Homo sapiens (Human))
BDBM325451
(3-methyl-1-(4-(4-(1- (pentan-3-yl)-1H-pyrazol- 4-y...)
Show SMILES CCC(CC)n1cc(cn1)-c1nc(cn2nccc12)-c1cnn(CC(O)C(C)C)c1
Show InChI InChI=1S/C22H29N7O/c1-5-18(6-2)28-12-17(10-25-28)22-20-7-8-23-29(20)13-19(26-22)16-9-24-27(11-16)14-21(30)15(3)4/h7-13,15,18,21,30H,5-6,14H2,1-4H3
US Patent
n/an/a 55n/an/an/an/an/an/a
ARRAY BIOPHARMA INC.; CELGENE CORPORATION
US Patent
Assay Description
Compounds of Formula I were screened for their ability to inhibit Tyk2 using the general enzyme inhibition assay method, in which the assay mixture c...
US Patent US11028093 (2021)
BindingDB Entry DOI: 10.7270/Q2T156RN
Tyrosine-protein kinase JAK1
(Homo sapiens (Human))
BDBM325451
(3-methyl-1-(4-(4-(1- (pentan-3-yl)-1H-pyrazol- 4-y...)
Show SMILES CCC(CC)n1cc(cn1)-c1nc(cn2nccc12)-c1cnn(CC(O)C(C)C)c1
Show InChI InChI=1S/C22H29N7O/c1-5-18(6-2)28-12-17(10-25-28)22-20-7-8-23-29(20)13-19(26-22)16-9-24-27(11-16)14-21(30)15(3)4/h7-13,15,18,21,30H,5-6,14H2,1-4H3
Reactome pathway
US Patent
n/an/a 5.50E+3n/an/an/an/an/an/a
ARRAY BIOPHARMA INC.; CELGENE CORPORATION
US Patent
Assay Description
Compounds of Formula I were screened for their ability to inhibit JAK1 using the general enzyme inhibition assay method, in which the assay mixture c...
US Patent US11028093 (2021)
BindingDB Entry DOI: 10.7270/Q2T156RN
Tyrosine-protein kinase JAK2
(Homo sapiens (Human))
BDBM325451
(3-methyl-1-(4-(4-(1- (pentan-3-yl)-1H-pyrazol- 4-y...)
Show SMILES CCC(CC)n1cc(cn1)-c1nc(cn2nccc12)-c1cnn(CC(O)C(C)C)c1
Show InChI InChI=1S/C22H29N7O/c1-5-18(6-2)28-12-17(10-25-28)22-20-7-8-23-29(20)13-19(26-22)16-9-24-27(11-16)14-21(30)15(3)4/h7-13,15,18,21,30H,5-6,14H2,1-4H3
Reactome pathway
US Patent
n/an/a 550n/an/an/an/an/an/a
ARRAY BIOPHARMA INC.; CELGENE CORPORATION
US Patent
Assay Description
Compounds of Formula I were screened for their ability to inhibit JAK2 using the general enzyme inhibition assay method, in which the assay mixture c...
US Patent US11028093 (2021)
BindingDB Entry DOI: 10.7270/Q2T156RN
Tyrosine-protein kinase JAK1
(Homo sapiens (Human))
BDBM325451
(3-methyl-1-(4-(4-(1- (pentan-3-yl)-1H-pyrazol- 4-y...)
Show SMILES CCC(CC)n1cc(cn1)-c1nc(cn2nccc12)-c1cnn(CC(O)C(C)C)c1
Show InChI InChI=1S/C22H29N7O/c1-5-18(6-2)28-12-17(10-25-28)22-20-7-8-23-29(20)13-19(26-22)16-9-24-27(11-16)14-21(30)15(3)4/h7-13,15,18,21,30H,5-6,14H2,1-4H3
Reactome pathway
US Patent
n/an/a 5.50E+3n/an/an/an/an/an/a
Array BioPharma Inc.; Celgene Corporation
US Patent
Assay Description
Compounds of Formula I were screened for their ability to inhibit JAK1 using the general enzyme inhibition assay method, in which the assay mixture c...
US Patent US10730880 (2020)
BindingDB Entry DOI: 10.7270/Q2CC13R9