BDBM325492 US10189845, Example 154B::US10730880, Example 154
SMILES: CCC(CC)n1cc(cn1)-c1nc(cn2nccc12)-c1cnn(c1)[C@H]1CCC[C@@H]1O
InChI Key: InChIKey=DVXZLEHKUCHABK-FPOVZHCZSA-N
Data: 12 IC50
Activity Spreadsheet -- Enzyme Inhibition Constant Data from BindingDB
Found 12 hits for monomerid = 325492
Trg + Lig
Ki
nM
ΔG°
kcal/mole
IC50
nM
Kd
nM
EC50/IC50
nM
koff
s-1
kon
M-1s-1
pHTemp
°C
Non-receptor tyrosine-protein kinase TYK2
(Homo sapiens (Human))
BDBM325492
(US10189845, Example 154B | US10730880, Example 154...)
Show SMILES CCC(CC)n1cc(cn1)-c1nc(cn2nccc12)-c1cnn(c1)[C@H]1CCC[C@@H]1O |r|
Show InChI InChI=1S/C22H27N7O/c1-3-17(4-2)27-13-16(11-24-27)22-20-8-9-23-29(20)14-18(26-22)15-10-25-28(12-15)19-6-5-7-21(19)30/h8-14,17,19,21,30H,3-7H2,1-2H3/t19-,21-/m0/s1
US Patent
n/an/a 55n/an/an/an/an/an/a
Array BioPharma Inc.
US Patent
Assay Description
Compounds of Formula I were screened for their ability to inhibit Tyk2 using the general enzyme inhibition assay method, in which the assay mixture c...
US Patent US10189845 (2019)
BindingDB Entry DOI: 10.7270/Q2Z03B7Q
Tyrosine-protein kinase JAK1
(Homo sapiens (Human))
BDBM325492
(US10189845, Example 154B | US10730880, Example 154...)
Show SMILES CCC(CC)n1cc(cn1)-c1nc(cn2nccc12)-c1cnn(c1)[C@H]1CCC[C@@H]1O |r|
Show InChI InChI=1S/C22H27N7O/c1-3-17(4-2)27-13-16(11-24-27)22-20-8-9-23-29(20)14-18(26-22)15-10-25-28(12-15)19-6-5-7-21(19)30/h8-14,17,19,21,30H,3-7H2,1-2H3/t19-,21-/m0/s1
Reactome pathway
US Patent
n/an/a 550n/an/an/an/an/an/a
Array BioPharma Inc.
US Patent
Assay Description
Compounds of Formula I were screened for their ability to inhibit JAK1 using the general enzyme inhibition assay method, in which the assay mixture c...
US Patent US10189845 (2019)
BindingDB Entry DOI: 10.7270/Q2Z03B7Q
Tyrosine-protein kinase JAK2
(Homo sapiens (Human))
BDBM325492
(US10189845, Example 154B | US10730880, Example 154...)
Show SMILES CCC(CC)n1cc(cn1)-c1nc(cn2nccc12)-c1cnn(c1)[C@H]1CCC[C@@H]1O |r|
Show InChI InChI=1S/C22H27N7O/c1-3-17(4-2)27-13-16(11-24-27)22-20-8-9-23-29(20)14-18(26-22)15-10-25-28(12-15)19-6-5-7-21(19)30/h8-14,17,19,21,30H,3-7H2,1-2H3/t19-,21-/m0/s1
Reactome pathway
US Patent
n/an/a 55n/an/an/an/an/an/a
Array BioPharma Inc.
US Patent
Assay Description
Compounds of Formula I were screened for their ability to inhibit JAK2 using the general enzyme inhibition assay method, in which the assay mixture c...
US Patent US10189845 (2019)
BindingDB Entry DOI: 10.7270/Q2Z03B7Q
Tyrosine-protein kinase JAK3
(Homo sapiens (Human))
BDBM325492
(US10189845, Example 154B | US10730880, Example 154...)
Show SMILES CCC(CC)n1cc(cn1)-c1nc(cn2nccc12)-c1cnn(c1)[C@H]1CCC[C@@H]1O |r|
Show InChI InChI=1S/C22H27N7O/c1-3-17(4-2)27-13-16(11-24-27)22-20-8-9-23-29(20)14-18(26-22)15-10-25-28(12-15)19-6-5-7-21(19)30/h8-14,17,19,21,30H,3-7H2,1-2H3/t19-,21-/m0/s1
Reactome pathway
US Patent
n/an/a 5.50E+3n/an/an/an/an/an/a
Array BioPharma Inc.
US Patent
Assay Description
Compounds of Formula I were screened for their ability to inhibit JAK3 using the general enzyme inhibition assay method, in which the assay mixture c...
US Patent US10189845 (2019)
BindingDB Entry DOI: 10.7270/Q2Z03B7Q
Non-receptor tyrosine-protein kinase TYK2
(Homo sapiens (Human))
BDBM325492
(US10189845, Example 154B | US10730880, Example 154...)
Show SMILES CCC(CC)n1cc(cn1)-c1nc(cn2nccc12)-c1cnn(c1)[C@H]1CCC[C@@H]1O |r|
Show InChI InChI=1S/C22H27N7O/c1-3-17(4-2)27-13-16(11-24-27)22-20-8-9-23-29(20)14-18(26-22)15-10-25-28(12-15)19-6-5-7-21(19)30/h8-14,17,19,21,30H,3-7H2,1-2H3/t19-,21-/m0/s1
US Patent
n/an/a 55n/an/an/an/an/an/a
Array BioPharma Inc.; Celgene Corporation
US Patent
Assay Description
Compounds of Formula I were screened for their ability to inhibit Tyk2 using the general enzyme inhibition assay method, in which the assay mixture c...
US Patent US10730880 (2020)
Tyrosine-protein kinase JAK3
(Homo sapiens (Human))
BDBM325492
(US10189845, Example 154B | US10730880, Example 154...)
Show SMILES CCC(CC)n1cc(cn1)-c1nc(cn2nccc12)-c1cnn(c1)[C@H]1CCC[C@@H]1O |r|
Show InChI InChI=1S/C22H27N7O/c1-3-17(4-2)27-13-16(11-24-27)22-20-8-9-23-29(20)14-18(26-22)15-10-25-28(12-15)19-6-5-7-21(19)30/h8-14,17,19,21,30H,3-7H2,1-2H3/t19-,21-/m0/s1
Reactome pathway
US Patent
n/an/a 5.50E+3n/an/an/an/an/an/a
ARRAY BIOPHARMA INC.; CELGENE CORPORATION
US Patent
Assay Description
Compounds of Formula I were screened for their ability to inhibit JAK3 using the general enzyme inhibition assay method, in which the assay mixture c...
US Patent US11028093 (2021)
Tyrosine-protein kinase JAK2
(Homo sapiens (Human))
BDBM325492
(US10189845, Example 154B | US10730880, Example 154...)
Show SMILES CCC(CC)n1cc(cn1)-c1nc(cn2nccc12)-c1cnn(c1)[C@H]1CCC[C@@H]1O |r|
Show InChI InChI=1S/C22H27N7O/c1-3-17(4-2)27-13-16(11-24-27)22-20-8-9-23-29(20)14-18(26-22)15-10-25-28(12-15)19-6-5-7-21(19)30/h8-14,17,19,21,30H,3-7H2,1-2H3/t19-,21-/m0/s1
Reactome pathway
US Patent
n/an/a 55n/an/an/an/an/an/a
Array BioPharma Inc.; Celgene Corporation
US Patent
Assay Description
Compounds of Formula I were screened for their ability to inhibit JAK2 using the general enzyme inhibition assay method, in which the assay mixture c...
US Patent US10730880 (2020)
Tyrosine-protein kinase JAK3
(Homo sapiens (Human))
BDBM325492
(US10189845, Example 154B | US10730880, Example 154...)
Show SMILES CCC(CC)n1cc(cn1)-c1nc(cn2nccc12)-c1cnn(c1)[C@H]1CCC[C@@H]1O |r|
Show InChI InChI=1S/C22H27N7O/c1-3-17(4-2)27-13-16(11-24-27)22-20-8-9-23-29(20)14-18(26-22)15-10-25-28(12-15)19-6-5-7-21(19)30/h8-14,17,19,21,30H,3-7H2,1-2H3/t19-,21-/m0/s1
Reactome pathway
US Patent
n/an/a 5.50E+3n/an/an/an/an/an/a
Array BioPharma Inc.; Celgene Corporation
US Patent
Assay Description
Compounds of Formula I were screened for their ability to inhibit JAK3 using the general enzyme inhibition assay method, in which the assay mixture c...
US Patent US10730880 (2020)
Non-receptor tyrosine-protein kinase TYK2
(Homo sapiens (Human))
BDBM325492
(US10189845, Example 154B | US10730880, Example 154...)
Show SMILES CCC(CC)n1cc(cn1)-c1nc(cn2nccc12)-c1cnn(c1)[C@H]1CCC[C@@H]1O |r|
Show InChI InChI=1S/C22H27N7O/c1-3-17(4-2)27-13-16(11-24-27)22-20-8-9-23-29(20)14-18(26-22)15-10-25-28(12-15)19-6-5-7-21(19)30/h8-14,17,19,21,30H,3-7H2,1-2H3/t19-,21-/m0/s1
US Patent
n/an/a 55n/an/an/an/an/an/a
ARRAY BIOPHARMA INC.; CELGENE CORPORATION
US Patent
Assay Description
Compounds of Formula I were screened for their ability to inhibit Tyk2 using the general enzyme inhibition assay method, in which the assay mixture c...
US Patent US11028093 (2021)
Tyrosine-protein kinase JAK1
(Homo sapiens (Human))
BDBM325492
(US10189845, Example 154B | US10730880, Example 154...)
Show SMILES CCC(CC)n1cc(cn1)-c1nc(cn2nccc12)-c1cnn(c1)[C@H]1CCC[C@@H]1O |r|
Show InChI InChI=1S/C22H27N7O/c1-3-17(4-2)27-13-16(11-24-27)22-20-8-9-23-29(20)14-18(26-22)15-10-25-28(12-15)19-6-5-7-21(19)30/h8-14,17,19,21,30H,3-7H2,1-2H3/t19-,21-/m0/s1
Reactome pathway
US Patent
n/an/a 550n/an/an/an/an/an/a
ARRAY BIOPHARMA INC.; CELGENE CORPORATION
US Patent
Assay Description
Compounds of Formula I were screened for their ability to inhibit JAK1 using the general enzyme inhibition assay method, in which the assay mixture c...
US Patent US11028093 (2021)
Tyrosine-protein kinase JAK2
(Homo sapiens (Human))
BDBM325492
(US10189845, Example 154B | US10730880, Example 154...)
Show SMILES CCC(CC)n1cc(cn1)-c1nc(cn2nccc12)-c1cnn(c1)[C@H]1CCC[C@@H]1O |r|
Show InChI InChI=1S/C22H27N7O/c1-3-17(4-2)27-13-16(11-24-27)22-20-8-9-23-29(20)14-18(26-22)15-10-25-28(12-15)19-6-5-7-21(19)30/h8-14,17,19,21,30H,3-7H2,1-2H3/t19-,21-/m0/s1
Reactome pathway
US Patent
n/an/a 55n/an/an/an/an/an/a
ARRAY BIOPHARMA INC.; CELGENE CORPORATION
US Patent
Assay Description
Compounds of Formula I were screened for their ability to inhibit JAK2 using the general enzyme inhibition assay method, in which the assay mixture c...
US Patent US11028093 (2021)
Tyrosine-protein kinase JAK1
(Homo sapiens (Human))
BDBM325492
(US10189845, Example 154B | US10730880, Example 154...)
Show SMILES CCC(CC)n1cc(cn1)-c1nc(cn2nccc12)-c1cnn(c1)[C@H]1CCC[C@@H]1O |r|
Show InChI InChI=1S/C22H27N7O/c1-3-17(4-2)27-13-16(11-24-27)22-20-8-9-23-29(20)14-18(26-22)15-10-25-28(12-15)19-6-5-7-21(19)30/h8-14,17,19,21,30H,3-7H2,1-2H3/t19-,21-/m0/s1
Reactome pathway
US Patent
n/an/a 550n/an/an/an/an/an/a
Array BioPharma Inc.; Celgene Corporation
US Patent
Assay Description
Compounds of Formula I were screened for their ability to inhibit JAK1 using the general enzyme inhibition assay method, in which the assay mixture c...
US Patent US10730880 (2020)