BDBM32580 CS-3
SMILES: CN[C@@H](C)C(=O)N[C@@H](C1CCCCC1)C(=O)N1CC[C@H](C)[C@H]1C(=O)Nc1ccccc1-c1ncccn1
InChI Key: InChIKey=HNXBUVYVPBCESY-WJNSRDFLSA-N
Data: 4 KI  3 Kd
PDB links: 1 PDB ID matches this monomer.
Activity Spreadsheet -- Enzyme Inhibition Constant Data from BindingDB
Found 7 hits for monomerid = 32580
Trg + Lig
Ki
nM
ΔG°
kcal/mole
IC50
nM
Kd
nM
EC50/IC50
nM
koff
s-1
kon
M-1s-1
pHTemp
°C
cIAP-1 BIR3
(Homo sapiens (Human))
BDBM32580
(CS-3)
Show SMILES CN[C@@H](C)C(=O)N[C@@H](C1CCCCC1)C(=O)N1CC[C@H](C)[C@H]1C(=O)Nc1ccccc1-c1ncccn1 |r|
Show InChI InChI=1S/C28H38N6O3/c1-18-14-17-34(28(37)23(20-10-5-4-6-11-20)33-26(35)19(2)29-3)24(18)27(36)32-22-13-8-7-12-21(22)25-30-15-9-16-31-25/h7-9,12-13,15-16,18-20,23-24,29H,4-6,10-11,14,17H2,1-3H3,(H,32,36)(H,33,35)/t18-,19-,23-,24-/m0/s1
16 -10.5n/an/an/an/an/a7.222
Genentech
Assay Description
Samples for fluorescence polarization affinity measurements were prepared by addition of serial dilutions of target protein to each well containing a...
ACS Chem Biol 4: 557-66 (2009)
Article DOI: 10.1021/cb900083m
BindingDB Entry DOI: 10.7270/Q2DJ5D0Q
cIAP-2 BIR3
(Homo sapiens (Human))
BDBM32580
(CS-3)
Show SMILES CN[C@@H](C)C(=O)N[C@@H](C1CCCCC1)C(=O)N1CC[C@H](C)[C@H]1C(=O)Nc1ccccc1-c1ncccn1 |r|
Show InChI InChI=1S/C28H38N6O3/c1-18-14-17-34(28(37)23(20-10-5-4-6-11-20)33-26(35)19(2)29-3)24(18)27(36)32-22-13-8-7-12-21(22)25-30-15-9-16-31-25/h7-9,12-13,15-16,18-20,23-24,29H,4-6,10-11,14,17H2,1-3H3,(H,32,36)(H,33,35)/t18-,19-,23-,24-/m0/s1
85 -9.54n/an/an/an/an/a7.222
Genentech
Assay Description
Samples for fluorescence polarization affinity measurements were prepared by addition of serial dilutions of target protein to each well containing a...
ACS Chem Biol 4: 557-66 (2009)
Article DOI: 10.1021/cb900083m
BindingDB Entry DOI: 10.7270/Q2DJ5D0Q
Genome polyprotein
(Zika virus)
BDBM32580
(CS-3)
Show SMILES CN[C@@H](C)C(=O)N[C@@H](C1CCCCC1)C(=O)N1CC[C@H](C)[C@H]1C(=O)Nc1ccccc1-c1ncccn1 |r|
Show InChI InChI=1S/C28H38N6O3/c1-18-14-17-34(28(37)23(20-10-5-4-6-11-20)33-26(35)19(2)29-3)24(18)27(36)32-22-13-8-7-12-21(22)25-30-15-9-16-31-25/h7-9,12-13,15-16,18-20,23-24,29H,4-6,10-11,14,17H2,1-3H3,(H,32,36)(H,33,35)/t18-,19-,23-,24-/m0/s1
NCI pathway
Reactome pathway
430n/an/an/an/an/an/an/an/a
Australian National University
Curated by ChEMBL
Assay Description
Inhibition of Zika virus NS2B-NS3 protease
Bioorg Med Chem Lett 30: (2020)
XIAP-BIR3
(Homo sapiens (Human))
BDBM32580
(CS-3)
Show SMILES CN[C@@H](C)C(=O)N[C@@H](C1CCCCC1)C(=O)N1CC[C@H](C)[C@H]1C(=O)Nc1ccccc1-c1ncccn1 |r|
Show InChI InChI=1S/C28H38N6O3/c1-18-14-17-34(28(37)23(20-10-5-4-6-11-20)33-26(35)19(2)29-3)24(18)27(36)32-22-13-8-7-12-21(22)25-30-15-9-16-31-25/h7-9,12-13,15-16,18-20,23-24,29H,4-6,10-11,14,17H2,1-3H3,(H,32,36)(H,33,35)/t18-,19-,23-,24-/m0/s1
>3.40E+4>-6.03n/an/an/an/an/a7.222
Genentech
Assay Description
Samples for fluorescence polarization affinity measurements were prepared by addition of serial dilutions of target protein to each well containing a...
ACS Chem Biol 4: 557-66 (2009)
Article DOI: 10.1021/cb900083m
BindingDB Entry DOI: 10.7270/Q2DJ5D0Q
X-linked inhibitor of apoptosis protein (XIAP)
(Homo sapiens (Human))
BDBM32580
(CS-3)
Show SMILES CN[C@@H](C)C(=O)N[C@@H](C1CCCCC1)C(=O)N1CC[C@H](C)[C@H]1C(=O)Nc1ccccc1-c1ncccn1 |r|
Show InChI InChI=1S/C28H38N6O3/c1-18-14-17-34(28(37)23(20-10-5-4-6-11-20)33-26(35)19(2)29-3)24(18)27(36)32-22-13-8-7-12-21(22)25-30-15-9-16-31-25/h7-9,12-13,15-16,18-20,23-24,29H,4-6,10-11,14,17H2,1-3H3,(H,32,36)(H,33,35)/t18-,19-,23-,24-/m0/s1
n/an/an/a 16n/an/an/an/an/a
Ningxia Medical University
Curated by ChEMBL
Assay Description
Binding affinity to XIAP-BIR3 domain (241 to 356 residues) (unknown origin) by fluorescence polarization-based competition assay
J Med Chem 62: 5750-5772 (2019)
Article DOI: 10.1021/acs.jmedchem.8b01668
3D
3D Structure (crystal)
Baculoviral IAP repeat-containing protein 2
(Homo sapiens (Human))
BDBM32580
(CS-3)
Show SMILES CN[C@@H](C)C(=O)N[C@@H](C1CCCCC1)C(=O)N1CC[C@H](C)[C@H]1C(=O)Nc1ccccc1-c1ncccn1 |r|
Show InChI InChI=1S/C28H38N6O3/c1-18-14-17-34(28(37)23(20-10-5-4-6-11-20)33-26(35)19(2)29-3)24(18)27(36)32-22-13-8-7-12-21(22)25-30-15-9-16-31-25/h7-9,12-13,15-16,18-20,23-24,29H,4-6,10-11,14,17H2,1-3H3,(H,32,36)(H,33,35)/t18-,19-,23-,24-/m0/s1
n/an/an/a 85n/an/an/an/an/a
Ningxia Medical University
Curated by ChEMBL
Assay Description
Binding affinity to cIAP1-BIR3 domain (unknown origin)
J Med Chem 62: 5750-5772 (2019)
Article DOI: 10.1021/acs.jmedchem.8b01668
Baculoviral IAP repeat-containing protein 3 (IAP1 BIR3)
(Homo sapiens (Human))
BDBM32580
(CS-3)
Show SMILES CN[C@@H](C)C(=O)N[C@@H](C1CCCCC1)C(=O)N1CC[C@H](C)[C@H]1C(=O)Nc1ccccc1-c1ncccn1 |r|
Show InChI InChI=1S/C28H38N6O3/c1-18-14-17-34(28(37)23(20-10-5-4-6-11-20)33-26(35)19(2)29-3)24(18)27(36)32-22-13-8-7-12-21(22)25-30-15-9-16-31-25/h7-9,12-13,15-16,18-20,23-24,29H,4-6,10-11,14,17H2,1-3H3,(H,32,36)(H,33,35)/t18-,19-,23-,24-/m0/s1
n/an/an/a 3.40E+3n/an/an/an/an/a
Ningxia Medical University
Curated by ChEMBL
Assay Description
Binding affinity to cIAP2-BIR3 domain (unknown origin)
J Med Chem 62: 5750-5772 (2019)
Article DOI: 10.1021/acs.jmedchem.8b01668