BDBM326282 US9637488, 65
SMILES: Cc1cccc2cc([C@H]3CCCN3c3ncnc(N)c3C#N)c(nc12)N1CCOCC1
InChI Key: InChIKey=VOXHHZVQZXHMEJ-LJQANCHMSA-N
Data: 1 IC50
Activity Spreadsheet -- Enzyme Inhibition Constant Data from BindingDB
Found 1 hit for monomerid = 326282
Trg + Lig
Ki
nM
ΔG°
kcal/mole
IC50
nM
Kd
nM
EC50/IC50
nM
koff
s-1
kon
M-1s-1
pHTemp
°C
Phosphatidylinositol 4,5-bisphosphate 3-kinase catalytic subunit gamma isoform
(Homo sapiens (Human))
BDBM326282
(US9637488, 65)
Show SMILES Cc1cccc2cc([C@H]3CCCN3c3ncnc(N)c3C#N)c(nc12)N1CCOCC1
Show InChI InChI=1S/C23H25N7O/c1-15-4-2-5-16-12-17(23(28-20(15)16)29-8-10-31-11-9-29)19-6-3-7-30(19)22-18(13-24)21(25)26-14-27-22/h2,4-5,12,14,19H,3,6-11H2,1H3,(H2,25,26,27)/t19-/m1/s1
NCI pathway
Reactome pathway
US Patent
n/an/a<0.0500n/an/an/an/an/an/a
TBA
US Patent
Assay Description
Exemplary compounds of the invention were tested their inhibitory activity or potency against PI3Kδ in 10-dose IC50 mode with 3-fold serial dilu...
US Patent US9637488 (2017)
BindingDB Entry DOI: 10.7270/Q2D220Q6