BDBM329 (3R,4S,5S,6R)-3,6-Bis(phenoxymethyl)-2,7-bis[4-(2-thienyl)benzyl]-4,5-dihydroxy-1,2,7-thiadiazepine 1,1-Dioxide::(3R,4S,5S,6R)-4,5-dihydroxy-3,6-bis(phenoxymethyl)-2,7-bis({[4-(thiophen-2-yl)phenyl]methyl})-1,2,7-thiadiazepane-1,1-dione::CHEMBL345997::Cyclic Sulfamide deriv. 7
SMILES: O[C@@H]1[C@@H](O)[C@@H](COc2ccccc2)N(Cc2ccc(cc2)-c2cccs2)S(=O)(=O)N(Cc2ccc(cc2)-c2cccs2)[C@@H]1COc1ccccc1
InChI Key: InChIKey=UMDCQGGNNGRKRN-JFDQHVTASA-N
Data: 2 KI
Activity Spreadsheet -- Enzyme Inhibition Constant Data from BindingDB
Found 2 hits for monomerid = 329
Trg + Lig
Ki
nM
ΔG°
kcal/mole
IC50
nM
Kd
nM
EC50/IC50
nM
koff
s-1
kon
M-1s-1
pHTemp
°C
Human immunodeficiency virus type 1 protease
(Human immunodeficiency virus type 1)
BDBM329
((3R,4S,5S,6R)-3,6-Bis(phenoxymethyl)-2,7-bis[4-(2-...)
Show SMILES O[C@@H]1[C@@H](O)[C@@H](COc2ccccc2)N(Cc2ccc(cc2)-c2cccs2)S(=O)(=O)N(Cc2ccc(cc2)-c2cccs2)[C@@H]1COc1ccccc1 |r|
Show InChI InChI=1S/C40H38N2O6S3/c43-39-35(27-47-33-9-3-1-4-10-33)41(25-29-15-19-31(20-16-29)37-13-7-23-49-37)51(45,46)42(36(40(39)44)28-48-34-11-5-2-6-12-34)26-30-17-21-32(22-18-30)38-14-8-24-50-38/h1-24,35-36,39-40,43-44H,25-28H2/t35-,36-,39+,40+/m1/s1
920n/an/an/an/an/an/an/an/a
Uppsala University
Curated by ChEMBL
Assay Description
Association rate constant for the interaction between inhibitor and HIV-1 protease
J Med Chem 45: 5430-9 (2002)
BindingDB Entry DOI: 10.7270/Q2GH9JP4
HIV-1 Protease
(Human immunodeficiency virus type 1)
BDBM329
((3R,4S,5S,6R)-3,6-Bis(phenoxymethyl)-2,7-bis[4-(2-...)
Show SMILES O[C@@H]1[C@@H](O)[C@@H](COc2ccccc2)N(Cc2ccc(cc2)-c2cccs2)S(=O)(=O)N(Cc2ccc(cc2)-c2cccs2)[C@@H]1COc1ccccc1 |r|
Show InChI InChI=1S/C40H38N2O6S3/c43-39-35(27-47-33-9-3-1-4-10-33)41(25-29-15-19-31(20-16-29)37-13-7-23-49-37)51(45,46)42(36(40(39)44)28-48-34-11-5-2-6-12-34)26-30-17-21-32(22-18-30)38-14-8-24-50-38/h1-24,35-36,39-40,43-44H,25-28H2/t35-,36-,39+,40+/m1/s1
920 -8.37n/an/an/an/an/a5.030
Uppsala University
Assay Description
A fluorimetric assay was used to determine the effects of the inhibitors on HIV-1 protease. This assay used an internally quenched fluorescent peptid...
J Med Chem 44: 155-69 (2001)
Article DOI: 10.1021/jm001024j
BindingDB Entry DOI: 10.7270/Q2JM27T6