null
SMILES: COc1cc(ccc1Nc1nc2ccc(cn2n1)-c1ccc(NC(=O)[C@H](C)c2ccc(F)cc2)cc1)N1CCOC1=O
InChI Key: InChIKey=SHWCNYPROTZRQA-LJQANCHMSA-N
Activity Spreadsheet -- Enzyme Inhibition Constant Data from BindingDB
Found 2 hits for monomerid = 329342
Trg + Lig
Ki
nM
ΔG°
kcal/mole
IC50
nM
Kd
nM
EC50/IC50
nM
koff
s-1
kon
M-1s-1
pHTemp
°C
Dual specificity protein kinase TTK
(Homo sapiens (Human))
BDBM329342
((2R)-2-(4-fluorophenyl)-N-[4-(2-{[2-methoxy-4-(2-o...)
Show SMILES COc1cc(ccc1Nc1nc2ccc(cn2n1)-c1ccc(NC(=O)[C@H](C)c2ccc(F)cc2)cc1)N1CCOC1=O |r|
Show InChI InChI=1S/C31H27FN6O4/c1-19(20-3-8-23(32)9-4-20)29(39)33-24-10-5-21(6-11-24)22-7-14-28-35-30(36-38(28)18-22)34-26-13-12-25(17-27(26)41-2)37-15-16-42-31(37)40/h3-14,17-19H,15-16H2,1-2H3,(H,33,39)(H,34,36)/t19-/m1/s1
n/an/a 1n/an/an/an/an/an/a
Bayer AG
Curated by ChEMBL
Assay Description
Inhibition of GST-tagged recombinant human MPS1 expressed in baculovirus expression system using biotin-Ahx-PWDPDDADITEILG as substrate preincubated ...
J Med Chem 63: 8025-8042 (2020)
Dual specificity protein kinase TTK
(Homo sapiens (Human))
BDBM329342
((2R)-2-(4-fluorophenyl)-N-[4-(2-{[2-methoxy-4-(2-o...)
Show SMILES COc1cc(ccc1Nc1nc2ccc(cn2n1)-c1ccc(NC(=O)[C@H](C)c2ccc(F)cc2)cc1)N1CCOC1=O |r|
Show InChI InChI=1S/C31H27FN6O4/c1-19(20-3-8-23(32)9-4-20)29(39)33-24-10-5-21(6-11-24)22-7-14-28-35-30(36-38(28)18-22)34-26-13-12-25(17-27(26)41-2)37-15-16-42-31(37)40/h3-14,17-19H,15-16H2,1-2H3,(H,33,39)(H,34,36)/t19-/m1/s1
US Patent
n/an/a<1n/an/an/an/an/an/a
BAYER PHARMA AKTIENGESELLSCHAFT; BAYER INTELLECTUAL PROPERTY GMBH
US Patent
Assay Description
For the assay 50 nl of a 100-fold concentrated solution of the test compound in DMSO was pipetted into a black low volume 384 well microtiter plate (...
US Patent US9663510 (2017)
BindingDB Entry DOI: 10.7270/Q2DV1N06