BDBM329344 (2R)-2-amino-2-(4-fluorophenyl)-N-[4-(2-{[2-methoxy-4-(methylsulfonyl)-phenyl]amino}[1,2,4]triazolo[1,5-a]pyridin-6-yl)phenyl]ethanamide::US9663510, Example 01.11
SMILES: COc1cc(ccc1Nc1nc2ccc(cn2n1)-c1ccc(NC(=O)[C@H](N)c2ccc(F)cc2)cc1)S(C)(=O)=O
InChI Key: InChIKey=HLXXKTRTKUQWGJ-AREMUKBSSA-N
Data: 1 IC50
Activity Spreadsheet -- Enzyme Inhibition Constant Data from BindingDB
Found 1 hit for monomerid = 329344
Trg + Lig
Ki
nM
ΔG°
kcal/mole
IC50
nM
Kd
nM
EC50/IC50
nM
koff
s-1
kon
M-1s-1
pHTemp
°C
Dual specificity protein kinase TTK
(Homo sapiens (Human))
BDBM329344
((2R)-2-amino-2-(4-fluorophenyl)-N-[4-(2-{[2-methox...)
Show SMILES COc1cc(ccc1Nc1nc2ccc(cn2n1)-c1ccc(NC(=O)[C@H](N)c2ccc(F)cc2)cc1)S(C)(=O)=O |r|
Show InChI InChI=1S/C28H25FN6O4S/c1-39-24-15-22(40(2,37)38)12-13-23(24)32-28-33-25-14-7-19(16-35(25)34-28)17-5-10-21(11-6-17)31-27(36)26(30)18-3-8-20(29)9-4-18/h3-16,26H,30H2,1-2H3,(H,31,36)(H,32,34)/t26-/m1/s1
US Patent
n/an/a<1n/an/an/an/an/an/a
BAYER PHARMA AKTIENGESELLSCHAFT; BAYER INTELLECTUAL PROPERTY GMBH
US Patent
Assay Description
For the assay 50 nl of a 100-fold concentrated solution of the test compound in DMSO was pipetted into a black low volume 384 well microtiter plate (...
US Patent US9663510 (2017)
BindingDB Entry DOI: 10.7270/Q2DV1N06