BDBM3297 4-Anilinoquinazoline deriv. 48::4-N-(3-bromophenyl)quinazoline-4,7-diamine::7-Amino-4-[(3-bromophenyl)aminolquinazoline::CHEMBL420624
SMILES: Nc1ccc2c(Nc3cccc(Br)c3)ncnc2c1
InChI Key: InChIKey=GHVBIROTJQDRQB-UHFFFAOYSA-N
Data: 2 IC50
Activity Spreadsheet -- Enzyme Inhibition Constant Data from BindingDB
Found 2 hits for monomerid = 3297
Trg + Lig
Ki
nM
ΔG°
kcal/mole
IC50
nM
Kd
nM
EC50/IC50
nM
koff
s-1
kon
M-1s-1
pHTemp
°C
Epidermal growth factor receptor
(Homo sapiens (Human))
BDBM3297
(4-Anilinoquinazoline deriv. 48 | 4-N-(3-bromopheny...)
Show SMILES Nc1ccc2c(Nc3cccc(Br)c3)ncnc2c1
Show InChI InChI=1S/C14H11BrN4/c15-9-2-1-3-11(6-9)19-14-12-5-4-10(16)7-13(12)17-8-18-14/h1-8H,16H2,(H,17,18,19)
n/an/a 0.100n/an/an/an/an/an/a
University of Auckland
Assay Description
IC50 is the inhibitor concentration which inhibits 50% of kinase activity that catalyzes the transfer of the terminal phosphate from [gamma-32P] labe...
J Med Chem 38: 3482-7 (1995)
Article DOI: 10.1021/jm00018a008
BindingDB Entry DOI: 10.7270/Q2319T3K
Epidermal growth factor receptor
(Homo sapiens (Human))
BDBM3297
(4-Anilinoquinazoline deriv. 48 | 4-N-(3-bromopheny...)
Show SMILES Nc1ccc2c(Nc3cccc(Br)c3)ncnc2c1
Show InChI InChI=1S/C14H11BrN4/c15-9-2-1-3-11(6-9)19-14-12-5-4-10(16)7-13(12)17-8-18-14/h1-8H,16H2,(H,17,18,19)
n/an/a 0.100n/an/an/an/an/an/a
Parke-Davis Pharmaceutical Research
Assay Description
IC50 is the inhibitor concentration which inhibits 50% of kinase activity that catalyzes the transfer of the terminal phosphate from [gamma-32P] labe...
J Med Chem 39: 267-76 (1996)
Article DOI: 10.1021/jm9503613
BindingDB Entry DOI: 10.7270/Q25T3HPR