BDBM329799 (rac)-((1R,2R,3S,4R)-2,3-Dihydroxy-4-((2-(3-(trifluoromethyl)phenyl)pyrazolo[1,5-::US10202389, Compound I-007::US9663525, Compound I-007::US9796725, Compound I-007
SMILES: NS(=O)(=O)OC[C@H]1C[C@@H](Nc2ccnc3cc(nn23)-c2cccc(c2)C(F)(F)F)[C@H](O)[C@@H]1O
InChI Key: InChIKey=YFTJRTRZJVPEGW-DGWLBADLSA-N
Data: 3 IC50
Activity Spreadsheet -- Enzyme Inhibition Constant Data from BindingDB
Found 3 hits for monomerid = 329799
Trg + Lig
Ki
nM
ΔG°
kcal/mole
IC50
nM
Kd
nM
EC50/IC50
nM
koff
s-1
kon
M-1s-1
pHTemp
°C
E2 ubiquitin-conjugating enzyme E1
(Homo sapiens (Human))
BDBM329799
((rac)-((1R,2R,3S,4R)-2,3-Dihydroxy-4-((2-(3-(trifl...)
Show SMILES NS(=O)(=O)OC[C@H]1C[C@@H](Nc2ccnc3cc(nn23)-c2cccc(c2)C(F)(F)F)[C@H](O)[C@@H]1O |r|
Show InChI InChI=1S/C19H20F3N5O5S/c20-19(21,22)12-3-1-2-10(6-12)13-8-16-24-5-4-15(27(16)26-13)25-14-7-11(17(28)18(14)29)9-32-33(23,30)31/h1-6,8,11,14,17-18,25,28-29H,7,9H2,(H2,23,30,31)/t11-,14-,17-,18+/m1/s1
Reactome pathway
US Patent
n/an/a<10n/an/an/an/an/an/a
Millennium Pharmaceuticals, Inc.
US Patent
Assay Description
The UAE enzymatic reaction totals 50 μL and contains 50 mmol HEPES (pH 7.5), 0.05% BSA, 2.5 mM MgCl2, 0.1 uM ATP, 8 nM GST-Ubc-2, 35 nM flag-ubi...
US Patent US9663525 (2017)
BindingDB Entry DOI: 10.7270/Q2HM5BJP
SUMO-activating enzyme subunit 2 (SAE2)
(Homo sapiens (Human))
BDBM329799
((rac)-((1R,2R,3S,4R)-2,3-Dihydroxy-4-((2-(3-(trifl...)
Show SMILES NS(=O)(=O)OC[C@H]1C[C@@H](Nc2ccnc3cc(nn23)-c2cccc(c2)C(F)(F)F)[C@H](O)[C@@H]1O |r|
Show InChI InChI=1S/C19H20F3N5O5S/c20-19(21,22)12-3-1-2-10(6-12)13-8-16-24-5-4-15(27(16)26-13)25-14-7-11(17(28)18(14)29)9-32-33(23,30)31/h1-6,8,11,14,17-18,25,28-29H,7,9H2,(H2,23,30,31)/t11-,14-,17-,18+/m1/s1
US Patent
n/an/a<10n/an/an/an/an/an/a
Millennium Pharmaceuticals, Inc.
US Patent
Assay Description
he UAE enzymatic reaction totals 50 μL and contains 50 mmol HEPES (pH 7.5), 0.05% BSA, 2.5 mM MgCl2, 0.1 uM ATP, 8 nM GST-Ubc-2, 35 nM flag-ubiq...
US Patent US9796725 (2017)
BindingDB Entry DOI: 10.7270/Q23T9KC6
Ubiquitin-like modifier-activating enzyme 1
(Homo sapiens (Human))
BDBM329799
((rac)-((1R,2R,3S,4R)-2,3-Dihydroxy-4-((2-(3-(trifl...)
Show SMILES NS(=O)(=O)OC[C@H]1C[C@@H](Nc2ccnc3cc(nn23)-c2cccc(c2)C(F)(F)F)[C@H](O)[C@@H]1O |r|
Show InChI InChI=1S/C19H20F3N5O5S/c20-19(21,22)12-3-1-2-10(6-12)13-8-16-24-5-4-15(27(16)26-13)25-14-7-11(17(28)18(14)29)9-32-33(23,30)31/h1-6,8,11,14,17-18,25,28-29H,7,9H2,(H2,23,30,31)/t11-,14-,17-,18+/m1/s1
Reactome pathway
US Patent
n/an/a<10n/an/an/an/an/an/a
Millennium Pharmaceuticals, Inc.
US Patent
Assay Description
The UAE enzymatic reaction totals 50 μL and contains 50 mmol HEPES (pH 7.5), 0.05% BSA, 2.5 mM MgCl2, 0.1 uM ATP, 8 nM GST-Ubc-2, 35 nM flag-ubi...
US Patent US10202389 (2019)
BindingDB Entry DOI: 10.7270/Q2DN475J