BDBM329802 (rac)-((1R,2R,3S,4R)-4-(2-(dibenzo[b,d]furan-4-yl)pyrazolo[1,5-a]pyrimidin-7-::US10202389, Compound I-103::US9663525, Compound I-010::US9663525, Compound I-103::US9796725, Compound I-010
SMILES: NS(=O)(=O)OC[C@H]1C[C@@H](Nc2ccnc3cc(nn23)-c2cccc3c4ccccc4oc23)[C@H](O)[C@@H]1O
InChI Key: InChIKey=SSECACVTMUFYCB-LMIJESTBSA-N
Data: 5 IC50
Activity Spreadsheet -- Enzyme Inhibition Constant Data from BindingDB
Found 5 hits for monomerid = 329802
Trg + Lig
Ki
nM
ΔG°
kcal/mole
IC50
nM
Kd
nM
EC50/IC50
nM
koff
s-1
kon
M-1s-1
pHTemp
°C
E2 ubiquitin-conjugating enzyme E1
(Homo sapiens (Human))
BDBM329802
((rac)-((1R,2R,3S,4R)-4-(2-(dibenzo[b,d]furan-4-yl)...)
Show SMILES NS(=O)(=O)OC[C@H]1C[C@@H](Nc2ccnc3cc(nn23)-c2cccc3c4ccccc4oc23)[C@H](O)[C@@H]1O |r|
Show InChI InChI=1S/C24H23N5O6S/c25-36(32,33)34-12-13-10-18(23(31)22(13)30)27-20-8-9-26-21-11-17(28-29(20)21)16-6-3-5-15-14-4-1-2-7-19(14)35-24(15)16/h1-9,11,13,18,22-23,27,30-31H,10,12H2,(H2,25,32,33)/t13-,18-,22-,23+/m1/s1
Reactome pathway
US Patent
n/an/a<10n/an/an/an/an/an/a
Millennium Pharmaceuticals, Inc.
US Patent
Assay Description
The UAE enzymatic reaction totals 50 μL and contains 50 mmol HEPES (pH 7.5), 0.05% BSA, 2.5 mM MgCl2, 0.1 uM ATP, 8 nM GST-Ubc-2, 35 nM flag-ubi...
US Patent US9663525 (2017)
BindingDB Entry DOI: 10.7270/Q2HM5BJP
E2 ubiquitin-conjugating enzyme E1
(Homo sapiens (Human))
BDBM329802
((rac)-((1R,2R,3S,4R)-4-(2-(dibenzo[b,d]furan-4-yl)...)
Show SMILES NS(=O)(=O)OC[C@H]1C[C@@H](Nc2ccnc3cc(nn23)-c2cccc3c4ccccc4oc23)[C@H](O)[C@@H]1O |r|
Show InChI InChI=1S/C24H23N5O6S/c25-36(32,33)34-12-13-10-18(23(31)22(13)30)27-20-8-9-26-21-11-17(28-29(20)21)16-6-3-5-15-14-4-1-2-7-19(14)35-24(15)16/h1-9,11,13,18,22-23,27,30-31H,10,12H2,(H2,25,32,33)/t13-,18-,22-,23+/m1/s1
Reactome pathway
US Patent
n/an/a<10n/an/an/an/an/an/a
Millennium Pharmaceuticals, Inc.
US Patent
Assay Description
The UAE enzymatic reaction totals 50 μL and contains 50 mmol HEPES (pH 7.5), 0.05% BSA, 2.5 mM MgCl2, 0.1 uM ATP, 8 nM GST-Ubc-2, 35 nM flag-ubi...
US Patent US9663525 (2017)
BindingDB Entry DOI: 10.7270/Q2HM5BJP
SUMO-activating enzyme subunit 2 (SAE2)
(Homo sapiens (Human))
BDBM329802
((rac)-((1R,2R,3S,4R)-4-(2-(dibenzo[b,d]furan-4-yl)...)
Show SMILES NS(=O)(=O)OC[C@H]1C[C@@H](Nc2ccnc3cc(nn23)-c2cccc3c4ccccc4oc23)[C@H](O)[C@@H]1O |r|
Show InChI InChI=1S/C24H23N5O6S/c25-36(32,33)34-12-13-10-18(23(31)22(13)30)27-20-8-9-26-21-11-17(28-29(20)21)16-6-3-5-15-14-4-1-2-7-19(14)35-24(15)16/h1-9,11,13,18,22-23,27,30-31H,10,12H2,(H2,25,32,33)/t13-,18-,22-,23+/m1/s1
US Patent
n/an/a<10n/an/an/an/an/an/a
Millennium Pharmaceuticals, Inc.
US Patent
Assay Description
he UAE enzymatic reaction totals 50 μL and contains 50 mmol HEPES (pH 7.5), 0.05% BSA, 2.5 mM MgCl2, 0.1 uM ATP, 8 nM GST-Ubc-2, 35 nM flag-ubiq...
US Patent US9796725 (2017)
BindingDB Entry DOI: 10.7270/Q23T9KC6
Ubiquitin-like modifier-activating enzyme 1
(Homo sapiens (Human))
BDBM329802
((rac)-((1R,2R,3S,4R)-4-(2-(dibenzo[b,d]furan-4-yl)...)
Show SMILES NS(=O)(=O)OC[C@H]1C[C@@H](Nc2ccnc3cc(nn23)-c2cccc3c4ccccc4oc23)[C@H](O)[C@@H]1O |r|
Show InChI InChI=1S/C24H23N5O6S/c25-36(32,33)34-12-13-10-18(23(31)22(13)30)27-20-8-9-26-21-11-17(28-29(20)21)16-6-3-5-15-14-4-1-2-7-19(14)35-24(15)16/h1-9,11,13,18,22-23,27,30-31H,10,12H2,(H2,25,32,33)/t13-,18-,22-,23+/m1/s1
Reactome pathway
US Patent
n/an/a<10n/an/an/an/an/an/a
Millennium Pharmaceuticals, Inc.
US Patent
Assay Description
The UAE enzymatic reaction totals 50 μL and contains 50 mmol HEPES (pH 7.5), 0.05% BSA, 2.5 mM MgCl2, 0.1 uM ATP, 8 nM GST-Ubc-2, 35 nM flag-ubi...
US Patent US10202389 (2019)
BindingDB Entry DOI: 10.7270/Q2DN475J
Ubiquitin-like modifier-activating enzyme 1
(Homo sapiens (Human))
BDBM329802
((rac)-((1R,2R,3S,4R)-4-(2-(dibenzo[b,d]furan-4-yl)...)
Show SMILES NS(=O)(=O)OC[C@H]1C[C@@H](Nc2ccnc3cc(nn23)-c2cccc3c4ccccc4oc23)[C@H](O)[C@@H]1O |r|
Show InChI InChI=1S/C24H23N5O6S/c25-36(32,33)34-12-13-10-18(23(31)22(13)30)27-20-8-9-26-21-11-17(28-29(20)21)16-6-3-5-15-14-4-1-2-7-19(14)35-24(15)16/h1-9,11,13,18,22-23,27,30-31H,10,12H2,(H2,25,32,33)/t13-,18-,22-,23+/m1/s1
Reactome pathway
US Patent
n/an/a<10n/an/an/an/an/an/a
Millennium Pharmaceuticals, Inc.
US Patent
Assay Description
The UAE enzymatic reaction totals 50 μL and contains 50 mmol HEPES (pH 7.5), 0.05% BSA, 2.5 mM MgCl2, 0.1 uM ATP, 8 nM GST-Ubc-2, 35 nM flag-ubi...
US Patent US10202389 (2019)
BindingDB Entry DOI: 10.7270/Q2DN475J