BDBM329825 (rac)-((1R,2R,3S,4R)-2,3-dihydroxy-4-(2-(5-(trifluoromethyl)quinolin-8-::US10202389, Compound I-033::US9663525, Compound I-033::US9796725, Compound I-033
SMILES: NS(=O)(=O)OC[C@H]1C[C@@H](Nc2ccnc3cc(nn23)-c2ccc(c3cccnc23)C(F)(F)F)[C@H](O)[C@@H]1O
InChI Key: InChIKey=PGJLCNBZMUBZPQ-NTPMGQCNSA-N
Data: 3 IC50
Activity Spreadsheet -- Enzyme Inhibition Constant Data from BindingDB
Found 3 hits for monomerid = 329825
Trg + Lig
Ki
nM
ΔG°
kcal/mole
IC50
nM
Kd
nM
EC50/IC50
nM
koff
s-1
kon
M-1s-1
pHTemp
°C
E2 ubiquitin-conjugating enzyme E1
(Homo sapiens (Human))
BDBM329825
((rac)-((1R,2R,3S,4R)-2,3-dihydroxy-4-(2-(5-(triflu...)
Show SMILES NS(=O)(=O)OC[C@H]1C[C@@H](Nc2ccnc3cc(nn23)-c2ccc(c3cccnc23)C(F)(F)F)[C@H](O)[C@@H]1O |r|
Show InChI InChI=1S/C22H21F3N6O5S/c23-22(24,25)14-4-3-13(19-12(14)2-1-6-28-19)15-9-18-27-7-5-17(31(18)30-15)29-16-8-11(20(32)21(16)33)10-36-37(26,34)35/h1-7,9,11,16,20-21,29,32-33H,8,10H2,(H2,26,34,35)/t11-,16-,20-,21+/m1/s1
Reactome pathway
US Patent
n/an/a<10n/an/an/an/an/an/a
Millennium Pharmaceuticals, Inc.
US Patent
Assay Description
The UAE enzymatic reaction totals 50 μL and contains 50 mmol HEPES (pH 7.5), 0.05% BSA, 2.5 mM MgCl2, 0.1 uM ATP, 8 nM GST-Ubc-2, 35 nM flag-ubi...
US Patent US9663525 (2017)
BindingDB Entry DOI: 10.7270/Q2HM5BJP
SUMO-activating enzyme subunit 2 (SAE2)
(Homo sapiens (Human))
BDBM329825
((rac)-((1R,2R,3S,4R)-2,3-dihydroxy-4-(2-(5-(triflu...)
Show SMILES NS(=O)(=O)OC[C@H]1C[C@@H](Nc2ccnc3cc(nn23)-c2ccc(c3cccnc23)C(F)(F)F)[C@H](O)[C@@H]1O |r|
Show InChI InChI=1S/C22H21F3N6O5S/c23-22(24,25)14-4-3-13(19-12(14)2-1-6-28-19)15-9-18-27-7-5-17(31(18)30-15)29-16-8-11(20(32)21(16)33)10-36-37(26,34)35/h1-7,9,11,16,20-21,29,32-33H,8,10H2,(H2,26,34,35)/t11-,16-,20-,21+/m1/s1
US Patent
n/an/a<10n/an/an/an/an/an/a
Millennium Pharmaceuticals, Inc.
US Patent
Assay Description
he UAE enzymatic reaction totals 50 μL and contains 50 mmol HEPES (pH 7.5), 0.05% BSA, 2.5 mM MgCl2, 0.1 uM ATP, 8 nM GST-Ubc-2, 35 nM flag-ubiq...
US Patent US9796725 (2017)
BindingDB Entry DOI: 10.7270/Q23T9KC6
Ubiquitin-like modifier-activating enzyme 1
(Homo sapiens (Human))
BDBM329825
((rac)-((1R,2R,3S,4R)-2,3-dihydroxy-4-(2-(5-(triflu...)
Show SMILES NS(=O)(=O)OC[C@H]1C[C@@H](Nc2ccnc3cc(nn23)-c2ccc(c3cccnc23)C(F)(F)F)[C@H](O)[C@@H]1O |r|
Show InChI InChI=1S/C22H21F3N6O5S/c23-22(24,25)14-4-3-13(19-12(14)2-1-6-28-19)15-9-18-27-7-5-17(31(18)30-15)29-16-8-11(20(32)21(16)33)10-36-37(26,34)35/h1-7,9,11,16,20-21,29,32-33H,8,10H2,(H2,26,34,35)/t11-,16-,20-,21+/m1/s1
Reactome pathway
US Patent
n/an/a<10n/an/an/an/an/an/a
Millennium Pharmaceuticals, Inc.
US Patent
Assay Description
The UAE enzymatic reaction totals 50 μL and contains 50 mmol HEPES (pH 7.5), 0.05% BSA, 2.5 mM MgCl2, 0.1 uM ATP, 8 nM GST-Ubc-2, 35 nM flag-ubi...
US Patent US10202389 (2019)
BindingDB Entry DOI: 10.7270/Q2DN475J