BDBM329869 (rac)-((1R,2R,3S,4R)-2,3-dihydroxy-4-(2-(3-(piperidin-1-yl)phenyl)pyrazolo[1,5-::US10202389, Compound I-077::US9663525, Compound I-077::US9796725, Compound I-077
SMILES: NS(=O)(=O)OC[C@H]1C[C@@H](Nc2ccnc3cc(nn23)-c2cccc(c2)N2CCCCC2)[C@H](O)[C@@H]1O
InChI Key: InChIKey=CJXXRKDGGBSZSZ-SAVREHANSA-N
Data: 3 IC50
Activity Spreadsheet -- Enzyme Inhibition Constant Data from BindingDB
Found 3 hits for monomerid = 329869
Trg + Lig
Ki
nM
ΔG°
kcal/mole
IC50
nM
Kd
nM
EC50/IC50
nM
koff
s-1
kon
M-1s-1
pHTemp
°C
E2 ubiquitin-conjugating enzyme E1
(Homo sapiens (Human))
BDBM329869
((rac)-((1R,2R,3S,4R)-2,3-dihydroxy-4-(2-(3-(piperi...)
Show SMILES NS(=O)(=O)OC[C@H]1C[C@@H](Nc2ccnc3cc(nn23)-c2cccc(c2)N2CCCCC2)[C@H](O)[C@@H]1O |r|
Show InChI InChI=1S/C23H30N6O5S/c24-35(32,33)34-14-16-12-19(23(31)22(16)30)26-20-7-8-25-21-13-18(27-29(20)21)15-5-4-6-17(11-15)28-9-2-1-3-10-28/h4-8,11,13,16,19,22-23,26,30-31H,1-3,9-10,12,14H2,(H2,24,32,33)/t16-,19-,22-,23+/m1/s1
Reactome pathway
US Patent
n/an/a<10n/an/an/an/an/an/a
Millennium Pharmaceuticals, Inc.
US Patent
Assay Description
The UAE enzymatic reaction totals 50 μL and contains 50 mmol HEPES (pH 7.5), 0.05% BSA, 2.5 mM MgCl2, 0.1 uM ATP, 8 nM GST-Ubc-2, 35 nM flag-ubi...
US Patent US9663525 (2017)
BindingDB Entry DOI: 10.7270/Q2HM5BJP
SUMO-activating enzyme subunit 2 (SAE2)
(Homo sapiens (Human))
BDBM329869
((rac)-((1R,2R,3S,4R)-2,3-dihydroxy-4-(2-(3-(piperi...)
Show SMILES NS(=O)(=O)OC[C@H]1C[C@@H](Nc2ccnc3cc(nn23)-c2cccc(c2)N2CCCCC2)[C@H](O)[C@@H]1O |r|
Show InChI InChI=1S/C23H30N6O5S/c24-35(32,33)34-14-16-12-19(23(31)22(16)30)26-20-7-8-25-21-13-18(27-29(20)21)15-5-4-6-17(11-15)28-9-2-1-3-10-28/h4-8,11,13,16,19,22-23,26,30-31H,1-3,9-10,12,14H2,(H2,24,32,33)/t16-,19-,22-,23+/m1/s1
US Patent
n/an/a<10n/an/an/an/an/an/a
Millennium Pharmaceuticals, Inc.
US Patent
Assay Description
he UAE enzymatic reaction totals 50 μL and contains 50 mmol HEPES (pH 7.5), 0.05% BSA, 2.5 mM MgCl2, 0.1 uM ATP, 8 nM GST-Ubc-2, 35 nM flag-ubiq...
US Patent US9796725 (2017)
BindingDB Entry DOI: 10.7270/Q23T9KC6
Ubiquitin-like modifier-activating enzyme 1
(Homo sapiens (Human))
BDBM329869
((rac)-((1R,2R,3S,4R)-2,3-dihydroxy-4-(2-(3-(piperi...)
Show SMILES NS(=O)(=O)OC[C@H]1C[C@@H](Nc2ccnc3cc(nn23)-c2cccc(c2)N2CCCCC2)[C@H](O)[C@@H]1O |r|
Show InChI InChI=1S/C23H30N6O5S/c24-35(32,33)34-14-16-12-19(23(31)22(16)30)26-20-7-8-25-21-13-18(27-29(20)21)15-5-4-6-17(11-15)28-9-2-1-3-10-28/h4-8,11,13,16,19,22-23,26,30-31H,1-3,9-10,12,14H2,(H2,24,32,33)/t16-,19-,22-,23+/m1/s1
Reactome pathway
US Patent
n/an/a<10n/an/an/an/an/an/a
Millennium Pharmaceuticals, Inc.
US Patent
Assay Description
The UAE enzymatic reaction totals 50 μL and contains 50 mmol HEPES (pH 7.5), 0.05% BSA, 2.5 mM MgCl2, 0.1 uM ATP, 8 nM GST-Ubc-2, 35 nM flag-ubi...
US Patent US10202389 (2019)
BindingDB Entry DOI: 10.7270/Q2DN475J