BDBM330336 US9725426, (E)-5-(2-(benzo[d][1,3]dioxol-5-ylmethylene)hydrazinyl)-1H-tetrazole
SMILES: C1Oc2ccc(\C=N\Nc3nnn[nH]3)cc2O1
InChI Key: InChIKey=OOCUUFTWZQLWKW-ONNFQVAWSA-N
Data: 1 IC50
Activity Spreadsheet -- Enzyme Inhibition Constant Data from BindingDB
Found 1 hit for monomerid = 330336
Trg + Lig
Ki
nM
ΔG°
kcal/mole
IC50
nM
Kd
nM
EC50/IC50
nM
koff
s-1
kon
M-1s-1
pHTemp
°C
Cystathionine gamma-lyase
(Homo sapiens (Human))
BDBM330336
(US9725426, (E)-5-(2-(benzo[d][1,3]dioxol-5-ylmethy...)
Show SMILES C1Oc2ccc(\C=N\Nc3nnn[nH]3)cc2O1
Show InChI InChI=1S/C9H8N6O2/c1-2-7-8(17-5-16-7)3-6(1)4-10-11-9-12-14-15-13-9/h1-4H,5H2,(H2,11,12,13,14,15)/b10-4+
Reactome pathway
US Patent
n/an/a>1.00E+5n/an/an/an/an/an/a
SOVA PHARMACEUTICALS, INC.
US Patent
Assay Description
Test compounds (from DMSO stock solutions) were added to (final concentrations) 20 ug/ml enzyme solution (human, mouse or rat recombinant CSE) plus 5...
US Patent US9725426 (2017)
BindingDB Entry DOI: 10.7270/Q2765HG7