BDBM330340 US9725426, 5-hydrazinyl-1H-tetrazole
SMILES: NNc1nnn[nH]1
InChI Key: InChIKey=FXYYVODGZXUHLT-UHFFFAOYSA-N
Data: 1 IC50
Activity Spreadsheet -- Enzyme Inhibition Constant Data from BindingDB
Found 1 hit for monomerid = 330340
Trg + Lig
Ki
nM
ΔG°
kcal/mole
IC50
nM
Kd
nM
EC50/IC50
nM
koff
s-1
kon
M-1s-1
pHTemp
°C
Cystathionine gamma-lyase
(Homo sapiens (Human))
BDBM330340
(US9725426, 5-hydrazinyl-1H-tetrazole)
Show SMILES NNc1nnn[nH]1
Show InChI InChI=1S/CH4N6/c2-3-1-4-6-7-5-1/h2H2,(H2,3,4,5,6,7)
Reactome pathway
US Patent
n/an/a 5.50E+4n/an/an/an/an/an/a
SOVA PHARMACEUTICALS, INC.
US Patent
Assay Description
Test compounds (from DMSO stock solutions) were added to (final concentrations) 20 ug/ml enzyme solution (human, mouse or rat recombinant CSE) plus 5...
US Patent US9725426 (2017)
BindingDB Entry DOI: 10.7270/Q2765HG7