BDBM332573 (2E)-3-(3,4-dichlorophenyl)-1-{7-[(4-fluorophenyl)carbonyl]-2,7-diazaspiro[3.5]non-2-yl}prop-2-en-1-one::US10196369, Compound C28
SMILES: Fc1ccc(cc1)C(=O)N1CCC2(CN(C2)C(=O)\C=C\c2ccc(Cl)c(Cl)c2)CC1
InChI Key: InChIKey=LMIJECRQXYTPCT-KRXBUXKQSA-N
Data: 1 IC50
Activity Spreadsheet -- Enzyme Inhibition Constant Data from BindingDB
Found 1 hit for monomerid = 332573
Trg + Lig
Ki
nM
ΔG°
kcal/mole
IC50
nM
Kd
nM
EC50/IC50
nM
koff
s-1
kon
M-1s-1
pHTemp
°C
G-protein coupled receptor 183
(Homo sapiens (Human))
BDBM332573
((2E)-3-(3,4-dichlorophenyl)-1-{7-[(4-fluorophenyl)...)
Show SMILES Fc1ccc(cc1)C(=O)N1CCC2(CN(C2)C(=O)\C=C\c2ccc(Cl)c(Cl)c2)CC1
Show InChI InChI=1S/C23H21Cl2FN2O2/c24-19-7-1-16(13-20(19)25)2-8-21(29)28-14-23(15-28)9-11-27(12-10-23)22(30)17-3-5-18(26)6-4-17/h1-8,13H,9-12,14-15H2/b8-2+
US Patent
n/an/a<5n/an/an/an/an/an/a
SANFORD BURNHAM PREBYS MEDICAL DISCOVERY INSTITUTE
US Patent
Assay Description
The test compounds that demonstrated a corrected % activity of >=50% were defined as inhibitors of the reaction. The experimental values were normali...
US Patent US10196369 (2019)
BindingDB Entry DOI: 10.7270/Q2BR8V88