BDBM332616 3-(4-bromophenyl)-1-(2-{[4-(trifluoromethyl)phenyl]carbonyl}-2,7-diazaspiro[3.5]non-7-yl)prop-2-yn-1-one::US10196369, Compound C71
SMILES: FC(F)(F)c1ccc(cc1)C(=O)N1CC2(C1)CCN(CC2)C(=O)C#Cc1ccc(Br)cc1
InChI Key: InChIKey=BSKLOXSRBFOHJF-UHFFFAOYSA-N
Data: 1 IC50
Activity Spreadsheet -- Enzyme Inhibition Constant Data from BindingDB
Found 1 hit for monomerid = 332616
Trg + Lig
Ki
nM
ΔG°
kcal/mole
IC50
nM
Kd
nM
EC50/IC50
nM
koff
s-1
kon
M-1s-1
pHTemp
°C
G-protein coupled receptor 183
(Homo sapiens (Human))
BDBM332616
(3-(4-bromophenyl)-1-(2-{[4-(trifluoromethyl)phenyl...)
Show SMILES FC(F)(F)c1ccc(cc1)C(=O)N1CC2(C1)CCN(CC2)C(=O)C#Cc1ccc(Br)cc1
Show InChI InChI=1S/C24H20BrF3N2O2/c25-20-8-1-17(2-9-20)3-10-21(31)29-13-11-23(12-14-29)15-30(16-23)22(32)18-4-6-19(7-5-18)24(26,27)28/h1-2,4-9H,11-16H2
US Patent
n/an/a<5n/an/an/an/an/an/a
SANFORD BURNHAM PREBYS MEDICAL DISCOVERY INSTITUTE
US Patent
Assay Description
The test compounds that demonstrated a corrected % activity of >=50% were defined as inhibitors of the reaction. The experimental values were normali...
US Patent US10196369 (2019)
BindingDB Entry DOI: 10.7270/Q2BR8V88