BDBM332618 3-(4-bromophenyl)-1-(2-{[4-(trifluoromethyl)phenyl]methyl}-2,7-diazaspiro[3.5]non-7-yl)prop-2-yn-1-one::US10196369, Compound C73
SMILES: FC(F)(F)c1ccc(CN2CC3(C2)CCN(CC3)C(=O)C#Cc2ccc(Br)cc2)cc1
InChI Key: InChIKey=QCUJHGZPYZHERY-UHFFFAOYSA-N
Data: 1 IC50
Activity Spreadsheet -- Enzyme Inhibition Constant Data from BindingDB
Found 1 hit for monomerid = 332618
Trg + Lig
Ki
nM
ΔG°
kcal/mole
IC50
nM
Kd
nM
EC50/IC50
nM
koff
s-1
kon
M-1s-1
pHTemp
°C
G-protein coupled receptor 183
(Homo sapiens (Human))
BDBM332618
(3-(4-bromophenyl)-1-(2-{[4-(trifluoromethyl)phenyl...)
Show SMILES FC(F)(F)c1ccc(CN2CC3(C2)CCN(CC3)C(=O)C#Cc2ccc(Br)cc2)cc1
Show InChI InChI=1S/C24H22BrF3N2O/c25-21-8-3-18(4-9-21)5-10-22(31)30-13-11-23(12-14-30)16-29(17-23)15-19-1-6-20(7-2-19)24(26,27)28/h1-4,6-9H,11-17H2
US Patent
n/an/a<5n/an/an/an/an/an/a
SANFORD BURNHAM PREBYS MEDICAL DISCOVERY INSTITUTE
US Patent
Assay Description
The test compounds that demonstrated a corrected % activity of >=50% were defined as inhibitors of the reaction. The experimental values were normali...
US Patent US10196369 (2019)
BindingDB Entry DOI: 10.7270/Q2BR8V88