null
SMILES: Clc1ccc(cc1)C#CC(=O)N1CC2(C1)CCN(CC2)C(=O)c1ccc(Cl)cc1
InChI Key: InChIKey=RYWDYULZAFGSFB-UHFFFAOYSA-N
Activity Spreadsheet -- Enzyme Inhibition Constant Data from BindingDB
Found 1 hit for monomerid = 332629
Trg + Lig
Ki
nM
ΔG°
kcal/mole
IC50
nM
Kd
nM
EC50/IC50
nM
koff
s-1
kon
M-1s-1
pHTemp
°C
G-protein coupled receptor 183
(Homo sapiens (Human))
BDBM332629
(3-(4-chlorophenyl)-1-{7-[(4-chlorophenyl)carbonyl]...)
Show SMILES Clc1ccc(cc1)C#CC(=O)N1CC2(C1)CCN(CC2)C(=O)c1ccc(Cl)cc1
Show InChI InChI=1S/C23H20Cl2N2O2/c24-19-6-1-17(2-7-19)3-10-21(28)27-15-23(16-27)11-13-26(14-12-23)22(29)18-4-8-20(25)9-5-18/h1-2,4-9H,11-16H2
US Patent
n/an/a<5n/an/an/an/an/an/a
SANFORD BURNHAM PREBYS MEDICAL DISCOVERY INSTITUTE
US Patent
Assay Description
The test compounds that demonstrated a corrected % activity of >=50% were defined as inhibitors of the reaction. The experimental values were normali...
US Patent US10196369 (2019)
BindingDB Entry DOI: 10.7270/Q2BR8V88