BDBM332998 US10196390, Compound I-287::US10336752, Compound 14
SMILES: Fc1cccc(C#N)c1-c1cc(Nc2ccc(cc2)C(=O)N2CCOCC2)c2C(=O)NCc2n1
InChI Key: InChIKey=LQQFWAIOMGFOLL-UHFFFAOYSA-N
Data: 2 KI  1 IC50
Activity Spreadsheet -- Enzyme Inhibition Constant Data from BindingDB
Found 4 hits for monomerid = 332998
Trg + Lig
Ki
nM
ΔG°
kcal/mole
IC50
nM
Kd
nM
EC50/IC50
nM
koff
s-1
kon
M-1s-1
pHTemp
°C
Non-receptor tyrosine-protein kinase TYK2
(Homo sapiens (Human))
BDBM332998
(US10196390, Compound I-287 | US10336752, Compound ...)
Show SMILES Fc1cccc(C#N)c1-c1cc(Nc2ccc(cc2)C(=O)N2CCOCC2)c2C(=O)NCc2n1
Show InChI InChI=1S/C25H20FN5O3/c26-18-3-1-2-16(13-27)22(18)19-12-20(23-21(30-19)14-28-24(23)32)29-17-6-4-15(5-7-17)25(33)31-8-10-34-11-9-31/h1-7,12H,8-11,14H2,(H,28,32)(H,29,30)
US Patent
<10n/an/an/an/an/an/an/an/a
Nimbus Lakshmi, Inc.
US Patent
Assay Description
The caliper machine employs an off chip mobility shift assay to detect phosphorylated peptide substrates from kinase assays, using microfluidics tech...
US Patent US10196390 (2019)
BindingDB Entry DOI: 10.7270/Q22809Q4
Tyrosine-protein kinase JAK2
(Homo sapiens (Human))
BDBM332998
(US10196390, Compound I-287 | US10336752, Compound ...)
Show SMILES Fc1cccc(C#N)c1-c1cc(Nc2ccc(cc2)C(=O)N2CCOCC2)c2C(=O)NCc2n1
Show InChI InChI=1S/C25H20FN5O3/c26-18-3-1-2-16(13-27)22(18)19-12-20(23-21(30-19)14-28-24(23)32)29-17-6-4-15(5-7-17)25(33)31-8-10-34-11-9-31/h1-7,12H,8-11,14H2,(H,28,32)(H,29,30)
Reactome pathway
US Patent
<10n/an/an/an/an/an/an/an/a
Nimbus Lakshmi, Inc.
US Patent
US Patent US10196390 (2019)
BindingDB Entry DOI: 10.7270/Q22809Q4
Non-receptor tyrosine-protein kinase TYK2
(Homo sapiens (Human))
BDBM332998
(US10196390, Compound I-287 | US10336752, Compound ...)
Show SMILES Fc1cccc(C#N)c1-c1cc(Nc2ccc(cc2)C(=O)N2CCOCC2)c2C(=O)NCc2n1
Show InChI InChI=1S/C25H20FN5O3/c26-18-3-1-2-16(13-27)22(18)19-12-20(23-21(30-19)14-28-24(23)32)29-17-6-4-15(5-7-17)25(33)31-8-10-34-11-9-31/h1-7,12H,8-11,14H2,(H,28,32)(H,29,30)
US Patent
n/an/a 24.2n/an/an/an/an/an/a
Nimbus Lakshmi, Inc.
US Patent
Assay Description
Compounds were serially diluted in DMSO then further diluted in 1x kinase buffer: 5 uL of buffer diluted compound was added into wells first, then 10...
US Patent US10336752 (2019)
BindingDB Entry DOI: 10.7270/Q28054Z6
Non-receptor tyrosine-protein kinase TYK2
(Homo sapiens (Human))
BDBM332998
(US10196390, Compound I-287 | US10336752, Compound ...)
Show SMILES Fc1cccc(C#N)c1-c1cc(Nc2ccc(cc2)C(=O)N2CCOCC2)c2C(=O)NCc2n1
Show InChI InChI=1S/C25H20FN5O3/c26-18-3-1-2-16(13-27)22(18)19-12-20(23-21(30-19)14-28-24(23)32)29-17-6-4-15(5-7-17)25(33)31-8-10-34-11-9-31/h1-7,12H,8-11,14H2,(H,28,32)(H,29,30)
n/an/a 24.2n/an/an/an/an/an/a
TBA
Citation and Details