BDBM333071 6-(3-fluoro-4-methoxy-2-pyridyl)-2-(2-pyridyl)-7,8-dihydro-5H-pyrido[4,3-d]pyrimidine::US10196391, Example 71
SMILES: COc1cc(ncc1F)N1CCc2nc(ncc2C1)-c1ccccn1
InChI Key: InChIKey=DEOARAHAYQHGJA-UHFFFAOYSA-N
Data: 1 IC50
Activity Spreadsheet -- Enzyme Inhibition Constant Data from BindingDB
Found 1 hit for monomerid = 333071
Trg + Lig
Ki
nM
ΔG°
kcal/mole
IC50
nM
Kd
nM
EC50/IC50
nM
koff
s-1
kon
M-1s-1
pHTemp
°C
Hepatitis GB virus B NS5B RNA-dependent RNA polymerase
(Hepatitis GB virus B)
BDBM333071
(6-(3-fluoro-4-methoxy-2-pyridyl)-2-(2-pyridyl)-7,8...)
Show SMILES COc1cc(ncc1F)N1CCc2nc(ncc2C1)-c1ccccn1
Show InChI InChI=1S/C18H16FN5O/c1-25-16-8-17(21-10-13(16)19)24-7-5-14-12(11-24)9-22-18(23-14)15-4-2-3-6-20-15/h2-4,6,8-10H,5,7,11H2,1H3
US Patent
n/an/a 330n/an/an/an/an/an/a
Hoffmann-La Roche Inc.
US Patent
Assay Description
HepG2.2.15 cells were seeded in duplicate into white, 96-well plates at 1.5×104 cells/well. The cells were treated with a three-fold serial dilution ...
US Patent US10196391 (2019)
BindingDB Entry DOI: 10.7270/Q2XK8HNM