BDBM333444 1-(5-tert- Butylisoxazol- 3-yl)-3-{3- [6-methoxy- 7-(2- methoxy- quinazolin- 4-yloxy]phenyl} urea hydrochloride::US9730937, Example 7
SMILES: COCCOc1cc2ncnc(Oc3cccc(NC(=O)Nc4cc(on4)C(C)(C)C)c3)c2cc1OC
InChI Key: InChIKey=HUPBPZKRSLMDLD-UHFFFAOYSA-N
Data: 1 IC50  4 Kd
Activity Spreadsheet -- Enzyme Inhibition Constant Data from BindingDB
Found 5 hits for monomerid = 333444
Trg + Lig
Ki
nM
ΔG°
kcal/mole
IC50
nM
Kd
nM
EC50/IC50
nM
koff
s-1
kon
M-1s-1
pHTemp
°C
B-RAF V600E
(Homo sapiens (Human))
BDBM333444
(1-(5-tert- Butylisoxazol- 3-yl)-3-{3- [6-methoxy- ...)
Show SMILES COCCOc1cc2ncnc(Oc3cccc(NC(=O)Nc4cc(on4)C(C)(C)C)c3)c2cc1OC
Show InChI InChI=1S/C26H29N5O6/c1-26(2,3)22-14-23(31-37-22)30-25(32)29-16-7-6-8-17(11-16)36-24-18-12-20(34-5)21(35-10-9-33-4)13-19(18)27-15-28-24/h6-8,11-15H,9-10H2,1-5H3,(H2,29,30,31,32)
US Patent
n/an/an/a<250n/an/an/an/an/a
AMBIT BIOSCIENCES CORPORATION
US Patent
Assay Description
Competition binding assays used herein were developed, validated and performed as described in Fabian et al., Nature Biotechnology 2005, 23, 329-336....
US Patent US9730937 (2017)
BindingDB Entry DOI: 10.7270/Q2M32XVC
Serine/threonine-protein kinase B-raf
(Homo sapiens (Human))
BDBM333444
(1-(5-tert- Butylisoxazol- 3-yl)-3-{3- [6-methoxy- ...)
Show SMILES COCCOc1cc2ncnc(Oc3cccc(NC(=O)Nc4cc(on4)C(C)(C)C)c3)c2cc1OC
Show InChI InChI=1S/C26H29N5O6/c1-26(2,3)22-14-23(31-37-22)30-25(32)29-16-7-6-8-17(11-16)36-24-18-12-20(34-5)21(35-10-9-33-4)13-19(18)27-15-28-24/h6-8,11-15H,9-10H2,1-5H3,(H2,29,30,31,32)
NCI pathway
Reactome pathway
US Patent
n/an/an/a 375n/an/an/an/an/a
AMBIT BIOSCIENCES CORPORATION
US Patent
Assay Description
Competition binding assays used herein were developed, validated and performed as described in Fabian et al., Nature Biotechnology 2005, 23, 329-336....
US Patent US9730937 (2017)
BindingDB Entry DOI: 10.7270/Q2M32XVC
Serine/threonine-protein kinase B-raf
(Homo sapiens (Human))
BDBM333444
(1-(5-tert- Butylisoxazol- 3-yl)-3-{3- [6-methoxy- ...)
Show SMILES COCCOc1cc2ncnc(Oc3cccc(NC(=O)Nc4cc(on4)C(C)(C)C)c3)c2cc1OC
Show InChI InChI=1S/C26H29N5O6/c1-26(2,3)22-14-23(31-37-22)30-25(32)29-16-7-6-8-17(11-16)36-24-18-12-20(34-5)21(35-10-9-33-4)13-19(18)27-15-28-24/h6-8,11-15H,9-10H2,1-5H3,(H2,29,30,31,32)
NCI pathway
Reactome pathway
n/an/a 100n/an/an/an/an/an/a
Ambit Biosciences Corporation
Curated by ChEMBL
Assay Description
Inhibition of BRAF V600E mutant-dependent MEK phosphorylation in A375 cells
Bioorg Med Chem Lett 21: 5342-6 (2011)
Article DOI: 10.1016/j.bmcl.2011.07.019
BindingDB Entry DOI: 10.7270/Q24T6N6Z
Serine/threonine-protein kinase B-raf
(Homo sapiens (Human))
BDBM333444
(1-(5-tert- Butylisoxazol- 3-yl)-3-{3- [6-methoxy- ...)
Show SMILES COCCOc1cc2ncnc(Oc3cccc(NC(=O)Nc4cc(on4)C(C)(C)C)c3)c2cc1OC
Show InChI InChI=1S/C26H29N5O6/c1-26(2,3)22-14-23(31-37-22)30-25(32)29-16-7-6-8-17(11-16)36-24-18-12-20(34-5)21(35-10-9-33-4)13-19(18)27-15-28-24/h6-8,11-15H,9-10H2,1-5H3,(H2,29,30,31,32)
NCI pathway
Reactome pathway
n/an/an/a 57n/an/an/an/an/a
Ambit Biosciences Corporation
Curated by ChEMBL
Assay Description
Binding affinity to BRAF V600E mutant
Bioorg Med Chem Lett 21: 5342-6 (2011)
Article DOI: 10.1016/j.bmcl.2011.07.019
BindingDB Entry DOI: 10.7270/Q24T6N6Z
RAF proto-oncogene serine/threonine-protein kinase
(Homo sapiens (Human))
BDBM333444
(1-(5-tert- Butylisoxazol- 3-yl)-3-{3- [6-methoxy- ...)
Show SMILES COCCOc1cc2ncnc(Oc3cccc(NC(=O)Nc4cc(on4)C(C)(C)C)c3)c2cc1OC
Show InChI InChI=1S/C26H29N5O6/c1-26(2,3)22-14-23(31-37-22)30-25(32)29-16-7-6-8-17(11-16)36-24-18-12-20(34-5)21(35-10-9-33-4)13-19(18)27-15-28-24/h6-8,11-15H,9-10H2,1-5H3,(H2,29,30,31,32)
NCI pathway
Reactome pathway
US Patent
n/an/an/a 375n/an/an/an/an/a
AMBIT BIOSCIENCES CORPORATION
US Patent
Assay Description
Competition binding assays used herein were developed, validated and performed as described in Fabian et al., Nature Biotechnology 2005, 23, 329-336....
US Patent US9730937 (2017)
BindingDB Entry DOI: 10.7270/Q2M32XVC