BDBM33360 pyridazinone, 2-47
SMILES: Clc1cc(Cl)cc(c1)-n1ncc(Cl)c(Cl)c1=O
InChI Key: InChIKey=UBKUOBNFCOTJAD-UHFFFAOYSA-N
Data: 2 IC50
Activity Spreadsheet -- Enzyme Inhibition Constant Data from BindingDB
Found 2 hits for monomerid = 33360
Trg + Lig
Ki
nM
ΔG°
kcal/mole
IC50
nM
Kd
nM
EC50/IC50
nM
koff
s-1
kon
M-1s-1
pHTemp
°C
Sortase A
(Bacillus anthracis)
BDBM33360
(pyridazinone, 2-47)
Show SMILES Clc1cc(Cl)cc(c1)-n1ncc(Cl)c(Cl)c1=O
Show InChI InChI=1S/C10H4Cl4N2O/c11-5-1-6(12)3-7(2-5)16-10(17)9(14)8(13)4-15-16/h1-4H
n/an/a 1.40E+4n/an/an/an/an/an/a
University of California at Los Angeles
Assay Description
A total of 30,000 chemical compounds (DiverSet Chemically Diverse Library and Combichem Library, ChemBridge Corp.) were screened for SrtA inhibition ...
Bioorg Med Chem 17: 7174-85 (2009)
Article DOI: 10.1016/j.bmc.2009.08.067
BindingDB Entry DOI: 10.7270/Q26W98F0
Sortase family protein
(Staphylococcus aureus)
BDBM33360
(pyridazinone, 2-47)
Show SMILES Clc1cc(Cl)cc(c1)-n1ncc(Cl)c(Cl)c1=O
Show InChI InChI=1S/C10H4Cl4N2O/c11-5-1-6(12)3-7(2-5)16-10(17)9(14)8(13)4-15-16/h1-4H
n/an/a 6.10E+4n/an/an/an/an/an/a
University of California at Los Angeles
Assay Description
A total of 30,000 chemical compounds (DiverSet Chemically Diverse Library and Combichem Library, ChemBridge Corp.) were screened for SrtA inhibition ...
Bioorg Med Chem 17: 7174-85 (2009)
Article DOI: 10.1016/j.bmc.2009.08.067
BindingDB Entry DOI: 10.7270/Q26W98F0