BDBM333669 1-(5- cyclopentyl- isoxazol- 3-yl)- 3-(3-(6- methoxy-7- (2- methoxyethoxy) quinazolin-4- yloxy)phenyl) urea::US9730937, Example 219
SMILES: COCCOc1cc2ncnc(Oc3cccc(NC(=O)Nc4cc(on4)C4CCCC4)c3)c2cc1OC
InChI Key: InChIKey=UQOSOHGUOXUJKS-UHFFFAOYSA-N
Data: 3 Kd
Activity Spreadsheet -- Enzyme Inhibition Constant Data from BindingDB
Found 3 hits for monomerid = 333669
Trg + Lig
Ki
nM
ΔG°
kcal/mole
IC50
nM
Kd
nM
EC50/IC50
nM
koff
s-1
kon
M-1s-1
pHTemp
°C
B-RAF V600E
(Homo sapiens (Human))
BDBM333669
(1-(5- cyclopentyl- isoxazol- 3-yl)- 3-(3-(6- metho...)
Show SMILES COCCOc1cc2ncnc(Oc3cccc(NC(=O)Nc4cc(on4)C4CCCC4)c3)c2cc1OC
Show InChI InChI=1S/C27H29N5O6/c1-34-10-11-36-24-14-21-20(13-23(24)35-2)26(29-16-28-21)37-19-9-5-8-18(12-19)30-27(33)31-25-15-22(38-32-25)17-6-3-4-7-17/h5,8-9,12-17H,3-4,6-7,10-11H2,1-2H3,(H2,30,31,32,33)
US Patent
n/an/an/a<250n/an/an/an/an/a
AMBIT BIOSCIENCES CORPORATION
US Patent
Assay Description
Competition binding assays used herein were developed, validated and performed as described in Fabian et al., Nature Biotechnology 2005, 23, 329-336....
US Patent US9730937 (2017)
BindingDB Entry DOI: 10.7270/Q2M32XVC
RAF proto-oncogene serine/threonine-protein kinase
(Homo sapiens (Human))
BDBM333669
(1-(5- cyclopentyl- isoxazol- 3-yl)- 3-(3-(6- metho...)
Show SMILES COCCOc1cc2ncnc(Oc3cccc(NC(=O)Nc4cc(on4)C4CCCC4)c3)c2cc1OC
Show InChI InChI=1S/C27H29N5O6/c1-34-10-11-36-24-14-21-20(13-23(24)35-2)26(29-16-28-21)37-19-9-5-8-18(12-19)30-27(33)31-25-15-22(38-32-25)17-6-3-4-7-17/h5,8-9,12-17H,3-4,6-7,10-11H2,1-2H3,(H2,30,31,32,33)
NCI pathway
Reactome pathway
US Patent
n/an/an/a<250n/an/an/an/an/a
AMBIT BIOSCIENCES CORPORATION
US Patent
Assay Description
Competition binding assays used herein were developed, validated and performed as described in Fabian et al., Nature Biotechnology 2005, 23, 329-336....
US Patent US9730937 (2017)
BindingDB Entry DOI: 10.7270/Q2M32XVC
Serine/threonine-protein kinase B-raf
(Homo sapiens (Human))
BDBM333669
(1-(5- cyclopentyl- isoxazol- 3-yl)- 3-(3-(6- metho...)
Show SMILES COCCOc1cc2ncnc(Oc3cccc(NC(=O)Nc4cc(on4)C4CCCC4)c3)c2cc1OC
Show InChI InChI=1S/C27H29N5O6/c1-34-10-11-36-24-14-21-20(13-23(24)35-2)26(29-16-28-21)37-19-9-5-8-18(12-19)30-27(33)31-25-15-22(38-32-25)17-6-3-4-7-17/h5,8-9,12-17H,3-4,6-7,10-11H2,1-2H3,(H2,30,31,32,33)
NCI pathway
Reactome pathway
US Patent
n/an/an/a<250n/an/an/an/an/a
AMBIT BIOSCIENCES CORPORATION
US Patent
Assay Description
Competition binding assays used herein were developed, validated and performed as described in Fabian et al., Nature Biotechnology 2005, 23, 329-336....
US Patent US9730937 (2017)
BindingDB Entry DOI: 10.7270/Q2M32XVC