BDBM333740 1-(5-tert- butylisoxdazol- 3-yl)- 3-(3-(6,7- dimethoxy- quinazolin- 4-yloxy)-2- methylphenyl) urea::US9730937, Example 290
SMILES: COc1cc2ncnc(Oc3cccc(NC(=O)Nc4cc(on4)C(C)(C)C)c3C)c2cc1OC
InChI Key: InChIKey=QLLMCJODYDQMKE-UHFFFAOYSA-N
Data: 1 IC50  4 Kd
Activity Spreadsheet -- Enzyme Inhibition Constant Data from BindingDB
Found 5 hits for monomerid = 333740
Trg + Lig
Ki
nM
ΔG°
kcal/mole
IC50
nM
Kd
nM
EC50/IC50
nM
koff
s-1
kon
M-1s-1
pHTemp
°C
B-RAF V600E
(Homo sapiens (Human))
BDBM333740
(1-(5-tert- butylisoxdazol- 3-yl)- 3-(3-(6,7- dimet...)
Show SMILES COc1cc2ncnc(Oc3cccc(NC(=O)Nc4cc(on4)C(C)(C)C)c3C)c2cc1OC
Show InChI InChI=1S/C25H27N5O5/c1-14-16(28-24(31)29-22-12-21(35-30-22)25(2,3)4)8-7-9-18(14)34-23-15-10-19(32-5)20(33-6)11-17(15)26-13-27-23/h7-13H,1-6H3,(H2,28,29,30,31)
US Patent
n/an/an/a<250n/an/an/an/an/a
AMBIT BIOSCIENCES CORPORATION
US Patent
Assay Description
Competition binding assays used herein were developed, validated and performed as described in Fabian et al., Nature Biotechnology 2005, 23, 329-336....
US Patent US9730937 (2017)
BindingDB Entry DOI: 10.7270/Q2M32XVC
Serine/threonine-protein kinase B-raf
(Homo sapiens (Human))
BDBM333740
(1-(5-tert- butylisoxdazol- 3-yl)- 3-(3-(6,7- dimet...)
Show SMILES COc1cc2ncnc(Oc3cccc(NC(=O)Nc4cc(on4)C(C)(C)C)c3C)c2cc1OC
Show InChI InChI=1S/C25H27N5O5/c1-14-16(28-24(31)29-22-12-21(35-30-22)25(2,3)4)8-7-9-18(14)34-23-15-10-19(32-5)20(33-6)11-17(15)26-13-27-23/h7-13H,1-6H3,(H2,28,29,30,31)
NCI pathway
Reactome pathway
US Patent
n/an/an/a<250n/an/an/an/an/a
AMBIT BIOSCIENCES CORPORATION
US Patent
Assay Description
Competition binding assays used herein were developed, validated and performed as described in Fabian et al., Nature Biotechnology 2005, 23, 329-336....
US Patent US9730937 (2017)
BindingDB Entry DOI: 10.7270/Q2M32XVC
Serine/threonine-protein kinase B-raf
(Homo sapiens (Human))
BDBM333740
(1-(5-tert- butylisoxdazol- 3-yl)- 3-(3-(6,7- dimet...)
Show SMILES COc1cc2ncnc(Oc3cccc(NC(=O)Nc4cc(on4)C(C)(C)C)c3C)c2cc1OC
Show InChI InChI=1S/C25H27N5O5/c1-14-16(28-24(31)29-22-12-21(35-30-22)25(2,3)4)8-7-9-18(14)34-23-15-10-19(32-5)20(33-6)11-17(15)26-13-27-23/h7-13H,1-6H3,(H2,28,29,30,31)
NCI pathway
Reactome pathway
n/an/an/a 38n/an/an/an/an/a
Ambit Biosciences Corporation
Curated by ChEMBL
Assay Description
Binding affinity to BRAF V600E mutant
Bioorg Med Chem Lett 21: 5342-6 (2011)
Article DOI: 10.1016/j.bmcl.2011.07.019
BindingDB Entry DOI: 10.7270/Q24T6N6Z
Serine/threonine-protein kinase B-raf
(Homo sapiens (Human))
BDBM333740
(1-(5-tert- butylisoxdazol- 3-yl)- 3-(3-(6,7- dimet...)
Show SMILES COc1cc2ncnc(Oc3cccc(NC(=O)Nc4cc(on4)C(C)(C)C)c3C)c2cc1OC
Show InChI InChI=1S/C25H27N5O5/c1-14-16(28-24(31)29-22-12-21(35-30-22)25(2,3)4)8-7-9-18(14)34-23-15-10-19(32-5)20(33-6)11-17(15)26-13-27-23/h7-13H,1-6H3,(H2,28,29,30,31)
NCI pathway
Reactome pathway
n/an/a 179n/an/an/an/an/an/a
Ambit Biosciences Corporation
Curated by ChEMBL
Assay Description
Inhibition of BRAF V600E mutant-dependent MEK phosphorylation in A375 cells
Bioorg Med Chem Lett 21: 5342-6 (2011)
Article DOI: 10.1016/j.bmcl.2011.07.019
BindingDB Entry DOI: 10.7270/Q24T6N6Z
RAF proto-oncogene serine/threonine-protein kinase
(Homo sapiens (Human))
BDBM333740
(1-(5-tert- butylisoxdazol- 3-yl)- 3-(3-(6,7- dimet...)
Show SMILES COc1cc2ncnc(Oc3cccc(NC(=O)Nc4cc(on4)C(C)(C)C)c3C)c2cc1OC
Show InChI InChI=1S/C25H27N5O5/c1-14-16(28-24(31)29-22-12-21(35-30-22)25(2,3)4)8-7-9-18(14)34-23-15-10-19(32-5)20(33-6)11-17(15)26-13-27-23/h7-13H,1-6H3,(H2,28,29,30,31)
NCI pathway
Reactome pathway
US Patent
n/an/an/a<250n/an/an/an/an/a
AMBIT BIOSCIENCES CORPORATION
US Patent
Assay Description
Competition binding assays used herein were developed, validated and performed as described in Fabian et al., Nature Biotechnology 2005, 23, 329-336....
US Patent US9730937 (2017)
BindingDB Entry DOI: 10.7270/Q2M32XVC