BDBM333992 (S)-1-(3-((9-ethyl-8-(1-ethyl-5- methyl-1H-pyrazol-4-yl)-9H- purin-6-yl)oxy)pyrrolidin-1- yl)propan-1-one::US9730940, Compound 2-93
SMILES: CCC(=O)N1CCC(C1)Oc1ncnc2n(CC)c(nc12)-c1cnn(CC)c1C
InChI Key: InChIKey=JYZPZLYBEYSKAY-UHFFFAOYSA-N
Data: 1 IC50
Activity Spreadsheet -- Enzyme Inhibition Constant Data from BindingDB
Found 1 hit for monomerid = 333992
Trg + Lig
Ki
nM
ΔG°
kcal/mole
IC50
nM
Kd
nM
EC50/IC50
nM
koff
s-1
kon
M-1s-1
pHTemp
°C
Phosphatidylinositol 4,5-bisphosphate 3-kinase catalytic subunit delta isoform
(Homo sapiens (Human))
BDBM333992
((S)-1-(3-((9-ethyl-8-(1-ethyl-5- methyl-1H-pyrazol...)
Show SMILES CCC(=O)N1CCC(C1)Oc1ncnc2n(CC)c(nc12)-c1cnn(CC)c1C
Show InChI InChI=1S/C20H27N7O2/c1-5-16(28)25-9-8-14(11-25)29-20-17-19(21-12-22-20)26(6-2)18(24-17)15-10-23-27(7-3)13(15)4/h10,12,14H,5-9,11H2,1-4H3
NCI pathway
Reactome pathway
US Patent
n/an/a 0.600n/an/an/an/an/an/a
Merck Sharp & Dohme
US Patent
Assay Description
The PI3-Kinase biochemical assay was optimized using the HTRF kit provided by Upstate (Millipore). The assay kit contains six reagents: 1) 4× Reactio...
US Patent US9730940 (2017)
BindingDB Entry DOI: 10.7270/Q2BP04WX