BDBM334114 6-({(3S)-1-[(3,3- difluorocyclobutyl)carbonyl]pyr- rolidin-3-yl}oxy)-9-ethyl-8-(5- fluoro-6-methoxypyridin-3-yl)- 9H-purine::US9730940, Compound 3-55
SMILES: CCn1c(nc2c(O[C@H]3CCN(C3)C(=O)C3CC(F)(F)C3)ncnc12)-c1cnc(OC)c(F)c1
InChI Key: InChIKey=AQMFOMNIDBXIKP-AWEZNQCLSA-N
Data: 1 IC50
Activity Spreadsheet -- Enzyme Inhibition Constant Data from BindingDB
Found 1 hit for monomerid = 334114
Trg + Lig
Ki
nM
ΔG°
kcal/mole
IC50
nM
Kd
nM
EC50/IC50
nM
koff
s-1
kon
M-1s-1
pHTemp
°C
Phosphatidylinositol 4,5-bisphosphate 3-kinase catalytic subunit delta isoform
(Homo sapiens (Human))
BDBM334114
(6-({(3S)-1-[(3,3- difluorocyclobutyl)carbonyl]pyr-...)
Show SMILES CCn1c(nc2c(O[C@H]3CCN(C3)C(=O)C3CC(F)(F)C3)ncnc12)-c1cnc(OC)c(F)c1 |r|
Show InChI InChI=1S/C22H23F3N6O3/c1-3-31-17(12-6-15(23)19(33-2)26-9-12)29-16-18(31)27-11-28-20(16)34-14-4-5-30(10-14)21(32)13-7-22(24,25)8-13/h6,9,11,13-14H,3-5,7-8,10H2,1-2H3/t14-/m0/s1
NCI pathway
Reactome pathway
US Patent
n/an/a<1n/an/an/an/an/an/a
Merck Sharp & Dohme
US Patent
Assay Description
The PI3-Kinase biochemical assay was optimized using the HTRF kit provided by Upstate (Millipore). The assay kit contains six reagents: 1) 4× Reactio...
US Patent US9730940 (2017)
BindingDB Entry DOI: 10.7270/Q2BP04WX