null
SMILES: COc1ccc(Cc2nc(C(O)=O)c(O)c(=O)[nH]2)cc1Br
InChI Key: InChIKey=LQQYBZYFFRDXNT-UHFFFAOYSA-N
Activity Spreadsheet -- Enzyme Inhibition Constant Data from BindingDB
Found 2 hits for monomerid = 33418
Trg + Lig
Ki
nM
ΔG°
kcal/mole
IC50
nM
Kd
nM
EC50/IC50
nM
koff
s-1
kon
M-1s-1
pHTemp
°C
Ribonuclease H1
(Homo sapiens (Human))
BDBM33418
(pyrimidinol carboxylic acid, 10)
Show SMILES COc1ccc(Cc2nc(C(O)=O)c(O)c(=O)[nH]2)cc1Br
Show InChI InChI=1S/C13H11BrN2O5/c1-21-8-3-2-6(4-7(8)14)5-9-15-10(13(19)20)11(17)12(18)16-9/h2-4,17H,5H2,1H3,(H,19,20)(H,15,16,18)
n/an/a 7.40E+4n/an/an/an/a8.020
Gilead Sciences Inc.
Assay Description
Enzyme activity was measuring substrate hydrolysis of RNase H. The intact substrate has a low background fluorescent signal and provides up to 50-fol...
J Med Chem 52: 5781-4 (2009)
Article DOI: 10.1021/jm900597q
BindingDB Entry DOI: 10.7270/Q2TM78F2
Reverse transcriptase/RNaseH
(Human immunodeficiency virus 1)
BDBM33418
(pyrimidinol carboxylic acid, 10)
Show SMILES COc1ccc(Cc2nc(C(O)=O)c(O)c(=O)[nH]2)cc1Br
Show InChI InChI=1S/C13H11BrN2O5/c1-21-8-3-2-6(4-7(8)14)5-9-15-10(13(19)20)11(17)12(18)16-9/h2-4,17H,5H2,1H3,(H,19,20)(H,15,16,18)
n/an/a 1.15E+3n/an/an/an/a8.020
Gilead Sciences Inc.
Assay Description
Enzyme activity was measuring substrate hydrolysis of RNase H. The intact substrate has a low background fluorescent signal and provides up to 50-fol...
J Med Chem 52: 5781-4 (2009)
Article DOI: 10.1021/jm900597q
BindingDB Entry DOI: 10.7270/Q2TM78F2