null
SMILES: COCCOCCOCCOc1cccc(Nc2nccc(Oc3ccc(NC(=O)Nc4cc(nn4-c4ccc(C)cc4)C(C)C)c4ccccc34)n2)c1
InChI Key: InChIKey=LNEAMQIVEZCBGU-UHFFFAOYSA-N
Activity Spreadsheet -- Enzyme Inhibition Constant Data from BindingDB
Found 4 hits for monomerid = 334325
Trg + Lig
Ki
nM
ΔG°
kcal/mole
IC50
nM
Kd
nM
EC50/IC50
nM
koff
s-1
kon
M-1s-1
pHTemp
°C
Mitogen-activated protein kinase 12
(Homo sapiens (Human))
BDBM334325
(1-(3-Isopropyl-1-(P-tolyl)-1H-pyrazol-5-yl)-3-(4-(...)
Show SMILES COCCOCCOCCOc1cccc(Nc2nccc(Oc3ccc(NC(=O)Nc4cc(nn4-c4ccc(C)cc4)C(C)C)c4ccccc34)n2)c1
Show InChI InChI=1S/C41H45N7O6/c1-28(2)36-27-38(48(47-36)31-14-12-29(3)13-15-31)45-41(49)44-35-16-17-37(34-11-6-5-10-33(34)35)54-39-18-19-42-40(46-39)43-30-8-7-9-32(26-30)53-25-24-52-23-22-51-21-20-50-4/h5-19,26-28H,20-25H2,1-4H3,(H,42,43,46)(H2,44,45,49)
Reactome pathway
US Patent
n/an/a 26n/an/an/an/an/an/a
RESPIVERT LIMITED; TOPIVERT PHARMA LIMITED
US Patent
Assay Description
The inhibitory activities of compounds of the invention against p38MAPKγ (MAPK12: Invitrogen), are evaluated in a similar fashion to that descri...
US Patent US9732063 (2017)
BindingDB Entry DOI: 10.7270/Q2PV6NGV
Glycogen synthase kinase-3 alpha
(Homo sapiens (Human))
BDBM334325
(1-(3-Isopropyl-1-(P-tolyl)-1H-pyrazol-5-yl)-3-(4-(...)
Show SMILES COCCOCCOCCOc1cccc(Nc2nccc(Oc3ccc(NC(=O)Nc4cc(nn4-c4ccc(C)cc4)C(C)C)c4ccccc34)n2)c1
Show InChI InChI=1S/C41H45N7O6/c1-28(2)36-27-38(48(47-36)31-14-12-29(3)13-15-31)45-41(49)44-35-16-17-37(34-11-6-5-10-33(34)35)54-39-18-19-42-40(46-39)43-30-8-7-9-32(26-30)53-25-24-52-23-22-51-21-20-50-4/h5-19,26-28H,20-25H2,1-4H3,(H,42,43,46)(H2,44,45,49)
NCI pathway
Reactome pathway
US Patent
n/an/a 3.72E+3n/an/an/an/an/an/a
RESPIVERT LIMITED; TOPIVERT PHARMA LIMITED
US Patent
Assay Description
The inhibitory activities of compounds of the invention against the GSK 3α enzyme isoform (Invitrogen), are evaluated by determining the level o...
US Patent US9732063 (2017)
BindingDB Entry DOI: 10.7270/Q2PV6NGV
Tyrosine-protein kinase SYK
(Homo sapiens (Human))
BDBM334325
(1-(3-Isopropyl-1-(P-tolyl)-1H-pyrazol-5-yl)-3-(4-(...)
Show SMILES COCCOCCOCCOc1cccc(Nc2nccc(Oc3ccc(NC(=O)Nc4cc(nn4-c4ccc(C)cc4)C(C)C)c4ccccc34)n2)c1
Show InChI InChI=1S/C41H45N7O6/c1-28(2)36-27-38(48(47-36)31-14-12-29(3)13-15-31)45-41(49)44-35-16-17-37(34-11-6-5-10-33(34)35)54-39-18-19-42-40(46-39)43-30-8-7-9-32(26-30)53-25-24-52-23-22-51-21-20-50-4/h5-19,26-28H,20-25H2,1-4H3,(H,42,43,46)(H2,44,45,49)
NCI pathway
Reactome pathway
US Patent
n/an/a>1.00E+3n/an/an/an/an/an/a
RESPIVERT LIMITED; TOPIVERT PHARMA LIMITED
US Patent
Assay Description
c-Src and Syk Enzyme InhibitionThe inhibitory activities of compounds of the invention against c-Src and Syk enzymes (Invitrogen), are evaluated in a...
US Patent US9732063 (2017)
BindingDB Entry DOI: 10.7270/Q2PV6NGV
Proto-oncogene tyrosine-protein kinase Src
(Homo sapiens (Human))
BDBM334325
(1-(3-Isopropyl-1-(P-tolyl)-1H-pyrazol-5-yl)-3-(4-(...)
Show SMILES COCCOCCOCCOc1cccc(Nc2nccc(Oc3ccc(NC(=O)Nc4cc(nn4-c4ccc(C)cc4)C(C)C)c4ccccc34)n2)c1
Show InChI InChI=1S/C41H45N7O6/c1-28(2)36-27-38(48(47-36)31-14-12-29(3)13-15-31)45-41(49)44-35-16-17-37(34-11-6-5-10-33(34)35)54-39-18-19-42-40(46-39)43-30-8-7-9-32(26-30)53-25-24-52-23-22-51-21-20-50-4/h5-19,26-28H,20-25H2,1-4H3,(H,42,43,46)(H2,44,45,49)
US Patent
n/an/a 154n/an/an/an/an/an/a
RESPIVERT LIMITED; TOPIVERT PHARMA LIMITED
US Patent
Assay Description
c-Src and Syk Enzyme InhibitionThe inhibitory activities of compounds of the invention against c-Src and Syk enzymes (Invitrogen), are evaluated in a...
US Patent US9732063 (2017)
BindingDB Entry DOI: 10.7270/Q2PV6NGV