BDBM334361 1-(3-(tert-Butyl)-1-(P-tolyl)-1H-pyrazol-5-yl)-3-(4-((2-((3-methoxy-5-(2-morpholinoethoxy)-phenyl)amino)pyrimidin-4-yl)oxy)naphthalen-1-yl)urea::US9732063, Example 45
SMILES: COc1cc(Nc2nccc(Oc3ccc(NC(=O)Nc4cc(nn4-c4ccc(C)cc4)C(C)(C)C)c4ccccc34)n2)cc(OCCN2CCOCC2)c1
InChI Key: InChIKey=SBGKNONFYWLESF-UHFFFAOYSA-N
Data: 4 IC50
Activity Spreadsheet -- Enzyme Inhibition Constant Data from BindingDB
Found 4 hits for monomerid = 334361
Trg + Lig
Ki
nM
ΔG°
kcal/mole
IC50
nM
Kd
nM
EC50/IC50
nM
koff
s-1
kon
M-1s-1
pHTemp
°C
Mitogen-activated protein kinase 12
(Homo sapiens (Human))
BDBM334361
(1-(3-(tert-Butyl)-1-(P-tolyl)-1H-pyrazol-5-yl)-3-(...)
Show SMILES COc1cc(Nc2nccc(Oc3ccc(NC(=O)Nc4cc(nn4-c4ccc(C)cc4)C(C)(C)C)c4ccccc34)n2)cc(OCCN2CCOCC2)c1
Show InChI InChI=1S/C42H46N8O5/c1-28-10-12-30(13-11-28)50-38(27-37(48-50)42(2,3)4)46-41(51)45-35-14-15-36(34-9-7-6-8-33(34)35)55-39-16-17-43-40(47-39)44-29-24-31(52-5)26-32(25-29)54-23-20-49-18-21-53-22-19-49/h6-17,24-27H,18-23H2,1-5H3,(H,43,44,47)(H2,45,46,51)
Reactome pathway
US Patent
n/an/a 144n/an/an/an/an/an/a
RESPIVERT LIMITED; TOPIVERT PHARMA LIMITED
US Patent
Assay Description
The inhibitory activities of compounds of the invention against p38MAPKγ (MAPK12: Invitrogen), are evaluated in a similar fashion to that descri...
US Patent US9732063 (2017)
BindingDB Entry DOI: 10.7270/Q2PV6NGV
Glycogen synthase kinase-3
(Homo sapiens (Human))
BDBM334361
(1-(3-(tert-Butyl)-1-(P-tolyl)-1H-pyrazol-5-yl)-3-(...)
Show SMILES COc1cc(Nc2nccc(Oc3ccc(NC(=O)Nc4cc(nn4-c4ccc(C)cc4)C(C)(C)C)c4ccccc34)n2)cc(OCCN2CCOCC2)c1
Show InChI InChI=1S/C42H46N8O5/c1-28-10-12-30(13-11-28)50-38(27-37(48-50)42(2,3)4)46-41(51)45-35-14-15-36(34-9-7-6-8-33(34)35)55-39-16-17-43-40(47-39)44-29-24-31(52-5)26-32(25-29)54-23-20-49-18-21-53-22-19-49/h6-17,24-27H,18-23H2,1-5H3,(H,43,44,47)(H2,45,46,51)
NCI pathway
Reactome pathway
US Patent
n/an/a 1.49E+3n/an/an/an/an/an/a
RESPIVERT LIMITED; TOPIVERT PHARMA LIMITED
US Patent
Assay Description
The inhibitory activities of compounds of the invention against the GSK 3α enzyme isoform (Invitrogen), are evaluated by determining the level o...
US Patent US9732063 (2017)
BindingDB Entry DOI: 10.7270/Q2PV6NGV
Tyrosine-protein kinase SYK
(Homo sapiens (Human))
BDBM334361
(1-(3-(tert-Butyl)-1-(P-tolyl)-1H-pyrazol-5-yl)-3-(...)
Show SMILES COc1cc(Nc2nccc(Oc3ccc(NC(=O)Nc4cc(nn4-c4ccc(C)cc4)C(C)(C)C)c4ccccc34)n2)cc(OCCN2CCOCC2)c1
Show InChI InChI=1S/C42H46N8O5/c1-28-10-12-30(13-11-28)50-38(27-37(48-50)42(2,3)4)46-41(51)45-35-14-15-36(34-9-7-6-8-33(34)35)55-39-16-17-43-40(47-39)44-29-24-31(52-5)26-32(25-29)54-23-20-49-18-21-53-22-19-49/h6-17,24-27H,18-23H2,1-5H3,(H,43,44,47)(H2,45,46,51)
NCI pathway
Reactome pathway
US Patent
n/an/a 15n/an/an/an/an/an/a
RESPIVERT LIMITED; TOPIVERT PHARMA LIMITED
US Patent
Assay Description
c-Src and Syk Enzyme InhibitionThe inhibitory activities of compounds of the invention against c-Src and Syk enzymes (Invitrogen), are evaluated in a...
US Patent US9732063 (2017)
BindingDB Entry DOI: 10.7270/Q2PV6NGV
Proto-oncogene tyrosine-protein kinase Src
(Homo sapiens (Human))
BDBM334361
(1-(3-(tert-Butyl)-1-(P-tolyl)-1H-pyrazol-5-yl)-3-(...)
Show SMILES COc1cc(Nc2nccc(Oc3ccc(NC(=O)Nc4cc(nn4-c4ccc(C)cc4)C(C)(C)C)c4ccccc34)n2)cc(OCCN2CCOCC2)c1
Show InChI InChI=1S/C42H46N8O5/c1-28-10-12-30(13-11-28)50-38(27-37(48-50)42(2,3)4)46-41(51)45-35-14-15-36(34-9-7-6-8-33(34)35)55-39-16-17-43-40(47-39)44-29-24-31(52-5)26-32(25-29)54-23-20-49-18-21-53-22-19-49/h6-17,24-27H,18-23H2,1-5H3,(H,43,44,47)(H2,45,46,51)
US Patent
n/an/a 12n/an/an/an/an/an/a
RESPIVERT LIMITED; TOPIVERT PHARMA LIMITED
US Patent
Assay Description
c-Src and Syk Enzyme InhibitionThe inhibitory activities of compounds of the invention against c-Src and Syk enzymes (Invitrogen), are evaluated in a...
US Patent US9732063 (2017)
BindingDB Entry DOI: 10.7270/Q2PV6NGV