null
SMILES: Cn1c([Se][Se]c2c(C(=O)OC(C)(C)C)c3ccccc3n2C)c(C(=O)OC(C)(C)C)c2ccccc12
InChI Key: InChIKey=PWTGGAFLPJCGFH-UHFFFAOYSA-N
Activity Spreadsheet -- Enzyme Inhibition Constant Data from BindingDB
Found 3 hits for monomerid = 3352
Trg + Lig
Ki
nM
ΔG°
kcal/mole
IC50
nM
Kd
nM
EC50/IC50
nM
koff
s-1
kon
M-1s-1
pHTemp
°C
Epidermal growth factor receptor
(Homo sapiens (Human))
BDBM3352
(2,2 -Diselenobis[1-methyl-1H-indole-3-carboxylic a...)
Show SMILES Cn1c([Se][Se]c2c(C(=O)OC(C)(C)C)c3ccccc3n2C)c(C(=O)OC(C)(C)C)c2ccccc12
Show InChI InChI=1S/C28H32N2O4Se2/c1-27(2,3)33-25(31)21-17-13-9-11-15-19(17)29(7)23(21)35-36-24-22(26(32)34-28(4,5)6)18-14-10-12-16-20(18)30(24)8/h9-16H,1-8H3
n/an/a>1.00E+5n/an/an/an/a7.422
Parke-Davis Pharmaceutical Research
Assay Description
IC50 is the inhibitor concentration which inhibits 50% of kinase activity that catalyzes the transfer of the terminal phosphate from [gamma-32P] labe...
J Med Chem 40: 413-26 (1997)
Article DOI: 10.1021/jm960689b
BindingDB Entry DOI: 10.7270/Q2TH8JWJ
Tyrosine-protein kinase transforming protein Src
(Avian sarcoma virus)
BDBM3352
(2,2 -Diselenobis[1-methyl-1H-indole-3-carboxylic a...)
Show SMILES Cn1c([Se][Se]c2c(C(=O)OC(C)(C)C)c3ccccc3n2C)c(C(=O)OC(C)(C)C)c2ccccc12
Show InChI InChI=1S/C28H32N2O4Se2/c1-27(2,3)33-25(31)21-17-13-9-11-15-19(17)29(7)23(21)35-36-24-22(26(32)34-28(4,5)6)18-14-10-12-16-20(18)30(24)8/h9-16H,1-8H3
n/an/a 1.50E+3n/an/an/an/an/an/a
Parke-Davis Pharmaceutical Research
Assay Description
IC50 is the inhibitor concentration which inhibits 50% of kinase activity that catalyzes the transfer of the terminal phosphate from [gamma-32P] labe...
J Med Chem 40: 413-26 (1997)
Article DOI: 10.1021/jm960689b
BindingDB Entry DOI: 10.7270/Q2TH8JWJ
Platelet-derived growth factor receptor beta
(Mus musculus (mouse))
BDBM3352
(2,2 -Diselenobis[1-methyl-1H-indole-3-carboxylic a...)
Show SMILES Cn1c([Se][Se]c2c(C(=O)OC(C)(C)C)c3ccccc3n2C)c(C(=O)OC(C)(C)C)c2ccccc12
Show InChI InChI=1S/C28H32N2O4Se2/c1-27(2,3)33-25(31)21-17-13-9-11-15-19(17)29(7)23(21)35-36-24-22(26(32)34-28(4,5)6)18-14-10-12-16-20(18)30(24)8/h9-16H,1-8H3
n/an/a>3.10E+4n/an/an/an/a7.425
Parke-Davis Pharmaceutical Research
Assay Description
IC50 is the inhibitor concentration which inhibits 50% of kinase activity that catalyzes the transfer of the terminal phosphate from [gamma-32P] labe...
J Med Chem 40: 413-26 (1997)
Article DOI: 10.1021/jm960689b
BindingDB Entry DOI: 10.7270/Q2TH8JWJ