BDBM335400 (3S)-3-[5-(6-amino-2-chloro-3-pyridinyl)-1H-imidazol-2-yl]-7-[5-chloro-2-(1H-tetrazol-1-yl)phenyl]-2,3-dihydro-5(1H)-indolizinone::US10717738, Example 210::US9732085, 210
SMILES: Nc1ccc(-c2cnc([nH]2)[C@@H]2CCc3cc(cc(=O)n23)-c2cc(Cl)ccc2-n2cnnn2)c(Cl)n1
InChI Key:
Data: 2 IC50
Activity Spreadsheet -- Enzyme Inhibition Constant Data from BindingDB
Found 2 hits for monomerid = 335400
Trg + Lig
Ki
nM
ΔG°
kcal/mole
IC50
nM
Kd
nM
EC50/IC50
nM
koff
s-1
kon
M-1s-1
pHTemp
°C
Coagulation factor XI
(Homo sapiens (Human))
BDBM335400
((3S)-3-[5-(6-amino-2-chloro-3-pyridinyl)-1H-imidaz...)
Show SMILES Nc1ccc(-c2cnc([nH]2)[C@@H]2CCc3cc(cc(=O)n23)-c2cc(Cl)ccc2-n2cnnn2)c(Cl)n1 |r|
Reactome pathway
US Patent
n/an/a 2.80n/an/an/an/an/an/a
ONO PHARMACEUTICAL CO., LTD.
US Patent
Assay Description
Human Factor XIa activity was measured at an enzyme concentration of 0.1 U/mL in 150 mM NaCl, 5 mM KCl, 1 mg/mL PEG6000, 50 mM HEPES-NaOH (pH7.4) wit...
US Patent US10717738 (2020)
Coagulation factor XI
(Homo sapiens (Human))
BDBM335400
((3S)-3-[5-(6-amino-2-chloro-3-pyridinyl)-1H-imidaz...)
Show SMILES Nc1ccc(-c2cnc([nH]2)[C@@H]2CCc3cc(cc(=O)n23)-c2cc(Cl)ccc2-n2cnnn2)c(Cl)n1 |r|
Reactome pathway
US Patent
n/an/a 2.80n/an/an/an/an/an/a
ONO PHARMACEUTICAL CO., LTD.
US Patent
Assay Description
Human Factor XIa (Haematologic Technologies Inc.) activity was measured at an enzyme concentration of 0.1 U/mL in 150 mM NaCl, 5 mM KCl, 1 mg/mL PEG6...
US Patent US9732085 (2017)
BindingDB Entry DOI: 10.7270/Q25X2C2P