null
SMILES: N[C@H](Cc1c([Se][Se]c2[nH]c3ccccc3c2C[C@@H](N)C(=O)NCc2ccccc2)[nH]c2ccccc12)C(=O)NCc1ccccc1
InChI Key: InChIKey=NHZUIHJUVWDGGV-LOYHVIPDSA-N
Activity Spreadsheet -- Enzyme Inhibition Constant Data from BindingDB
Found 3 hits for monomerid = 3361
Trg + Lig
Ki
nM
ΔG°
kcal/mole
IC50
nM
Kd
nM
EC50/IC50
nM
koff
s-1
kon
M-1s-1
pHTemp
°C
Epidermal growth factor receptor
(Homo sapiens (Human))
BDBM3361
((2R)-2-amino-3-[2-({3-[(2R)-2-amino-2-(benzylcarba...)
Show SMILES N[C@H](Cc1c([Se][Se]c2[nH]c3ccccc3c2C[C@@H](N)C(=O)NCc2ccccc2)[nH]c2ccccc12)C(=O)NCc1ccccc1 |r|
Show InChI InChI=1S/C36H36N6O2Se2/c37-29(33(43)39-21-23-11-3-1-4-12-23)19-27-25-15-7-9-17-31(25)41-35(27)45-46-36-28(26-16-8-10-18-32(26)42-36)20-30(38)34(44)40-22-24-13-5-2-6-14-24/h1-18,29-30,41-42H,19-22,37-38H2,(H,39,43)(H,40,44)/t29-,30-/m1/s1
n/an/a 900n/an/an/an/a7.422
Parke-Davis Pharmaceutical Research
Assay Description
IC50 is the inhibitor concentration which inhibits 50% of kinase activity that catalyzes the transfer of the terminal phosphate from [gamma-32P] labe...
J Med Chem 40: 413-26 (1997)
Article DOI: 10.1021/jm960689b
BindingDB Entry DOI: 10.7270/Q2TH8JWJ
Tyrosine-protein kinase transforming protein Src
(Avian sarcoma virus)
BDBM3361
((2R)-2-amino-3-[2-({3-[(2R)-2-amino-2-(benzylcarba...)
Show SMILES N[C@H](Cc1c([Se][Se]c2[nH]c3ccccc3c2C[C@@H](N)C(=O)NCc2ccccc2)[nH]c2ccccc12)C(=O)NCc1ccccc1 |r|
Show InChI InChI=1S/C36H36N6O2Se2/c37-29(33(43)39-21-23-11-3-1-4-12-23)19-27-25-15-7-9-17-31(25)41-35(27)45-46-36-28(26-16-8-10-18-32(26)42-36)20-30(38)34(44)40-22-24-13-5-2-6-14-24/h1-18,29-30,41-42H,19-22,37-38H2,(H,39,43)(H,40,44)/t29-,30-/m1/s1
n/an/a 2.00E+3n/an/an/an/an/an/a
Parke-Davis Pharmaceutical Research
Assay Description
IC50 is the inhibitor concentration which inhibits 50% of kinase activity that catalyzes the transfer of the terminal phosphate from [gamma-32P] labe...
J Med Chem 40: 413-26 (1997)
Article DOI: 10.1021/jm960689b
BindingDB Entry DOI: 10.7270/Q2TH8JWJ
Platelet-derived growth factor receptor beta
(Mus musculus (mouse))
BDBM3361
((2R)-2-amino-3-[2-({3-[(2R)-2-amino-2-(benzylcarba...)
Show SMILES N[C@H](Cc1c([Se][Se]c2[nH]c3ccccc3c2C[C@@H](N)C(=O)NCc2ccccc2)[nH]c2ccccc12)C(=O)NCc1ccccc1 |r|
Show InChI InChI=1S/C36H36N6O2Se2/c37-29(33(43)39-21-23-11-3-1-4-12-23)19-27-25-15-7-9-17-31(25)41-35(27)45-46-36-28(26-16-8-10-18-32(26)42-36)20-30(38)34(44)40-22-24-13-5-2-6-14-24/h1-18,29-30,41-42H,19-22,37-38H2,(H,39,43)(H,40,44)/t29-,30-/m1/s1
n/an/a 1.41E+4n/an/an/an/an/an/a
Parke-Davis Pharmaceutical Research
Assay Description
IC50 is the inhibitor concentration which inhibits 50% of kinase activity that catalyzes the transfer of the terminal phosphate from [gamma-32P] labe...
J Med Chem 40: 413-26 (1997)
Article DOI: 10.1021/jm960689b
BindingDB Entry DOI: 10.7270/Q2TH8JWJ