BDBM336143 US9744148, 13
SMILES: COc1ccc(NC(=O)C(OC(=O)Cc2ccc(Cl)cc2)c2ccccc2)cc1
InChI Key: InChIKey=QKYBMTADHYYBQX-UHFFFAOYSA-N
Data: 1 IC50
Activity Spreadsheet -- Enzyme Inhibition Constant Data from BindingDB
Found 1 hit for monomerid = 336143
Trg + Lig
Ki
nM
ΔG°
kcal/mole
IC50
nM
Kd
nM
EC50/IC50
nM
koff
s-1
kon
M-1s-1
pHTemp
°C
Kallikrein 7
(Homo sapiens (Human))
BDBM336143
(US9744148, 13)
Show SMILES COc1ccc(NC(=O)C(OC(=O)Cc2ccc(Cl)cc2)c2ccccc2)cc1
Show InChI InChI=1S/C23H20ClNO4/c1-28-20-13-11-19(12-14-20)25-23(27)22(17-5-3-2-4-6-17)29-21(26)15-16-7-9-18(24)10-8-16/h2-14,22H,15H2,1H3,(H,25,27)
Reactome pathway
US Patent
n/an/a 170n/an/an/an/an/an/a
SIXERA Pharma AB
US Patent
Assay Description
Substrate:(MeO-Suc-Arg-Pro-Tyr-pNA), acetate salt, Peptide international, lot #906841, previously named S-2586Enzyme: Active human KLK7 (SCCE) 0.62 m...
US Patent US9744148 (2017)
BindingDB Entry DOI: 10.7270/Q2TH8PSV