null
SMILES: C[C@H]1C[C@H]2CSC(NC(=O)c3ccccc3)=N[C@]2(CO1)c1nc(NC(=O)c2ccc(cn2)C#N)cs1
InChI Key: InChIKey=CICFETZIRSPHDM-LCAJTWGOSA-N
Activity Spreadsheet -- Enzyme Inhibition Constant Data from BindingDB
Found 1 hit for monomerid = 336257
Trg + Lig
Ki
nM
ΔG°
kcal/mole
IC50
nM
Kd
nM
EC50/IC50
nM
koff
s-1
kon
M-1s-1
pHTemp
°C
Beta-secretase 1
(Homo sapiens (Human))
BDBM336257
(N-{2-[(4aR,6S,8aR)-2-Amino-6-methyl-4,4a,5,6-tetra...)
Show SMILES C[C@H]1C[C@H]2CSC(NC(=O)c3ccccc3)=N[C@]2(CO1)c1nc(NC(=O)c2ccc(cn2)C#N)cs1 |r,c:16|
Show InChI InChI=1S/C25H22N6O3S2/c1-15-9-18-12-36-24(30-21(32)17-5-3-2-4-6-17)31-25(18,14-34-15)23-29-20(13-35-23)28-22(33)19-8-7-16(10-26)11-27-19/h2-8,11,13,15,18H,9,12,14H2,1H3,(H,28,33)(H,30,31,32)/t15-,18-,25-/m0/s1
US Patent
n/an/a 22n/an/an/an/an/an/a
Pfizer Inc.
US Patent
Assay Description
Beta-secretase (BACE) is one of the enzymes involved in the generation of the amyloid beta peptide found in the amyloid plaques of Alzheimer's Di...
US Patent US9744173 (2017)
BindingDB Entry DOI: 10.7270/Q2K076CZ